{"text_format":"3","workbook":"xlsx","n_sheets":9,"sheets":["Menu Główne","Cennik SAP","Cennik Titanus - pozostałe","Dodatkowa gwarancja","Uwagi Ogólne","Fire EN 54_old","Fire EN 54 FX 4,704","Fire EN 54","Warranty Extension"],"not_rendered":{"images":214,"external_links":7,"defined_names":298},"read":"whole","date_system":"1900"}

{"sheet":"Menu Główne","index":0,"n_rows":0,"n_cols":0,"rows_kept":0}

{"sheet":"Cennik SAP","index":1,"n_rows":371,"n_cols":14,"rows_kept":371,"merged":[[1,0,1,11],[2,0,2,3],[2,5,2,11],[7,0,7,3],[7,5,7,11],[8,0,8,3],[8,5,8,11],[11,0,11,3],[11,5,11,11],[16,0,16,3],[16,5,16,11],[19,0,19,3],[19,5,19,11],[32,0,32,3],[32,5,32,11],[35,0,35,3],[35,5,35,11],[51,0,51,3],[51,5,51,11],[57,0,57,3],[57,5,57,11],[62,0,62,3],[62,5,62,11],[66,0,66,3],[66,5,66,11],[70,0,70,3],[70,5,70,11],[72,0,72,3],[72,5,72,11],[73,0,73,3],[73,5,73,11],[78,0,78,3],[78,5,78,11],[86,0,86,3],[86,5,86,11],[96,0,96,3],[96,5,96,11],[97,0,97,3],[97,5,97,11],[106,0,106,3],[106,5,106,11],[122,0,122,3],[122,5,122,11],[123,0,123,3],[123,5,123,11],[133,0,133,3],[133,5,133,11],[134,0,147,0],[148,0,148,3],[148,5,148,11],[149,0,151,0],[149,8,151,8],[153,0,154,0],[153,8,154,8],[155,0,157,0],[155,8,157,8],[158,0,159,0],[158,8,159,8],[161,0,161,3],[161,5,161,11],[174,0,174,3],[174,5,174,11],[177,0,177,3],[177,5,177,11],[186,0,186,3],[186,5,186,11],[187,0,187,3],[187,5,187,11],[192,0,192,3],[192,5,192,11],[201,0,201,3],[201,5,201,11],[202,0,202,3],[202,5,202,11],[221,0,221,3],[221,5,221,11],[226,0,226,3],[226,5,226,11],[227,0,227,3],[227,5,227,11],[230,0,230,3],[230,5,230,11],[239,0,239,3],[239,5,239,11],[252,0,252,3],[252,5,252,11],[258,0,258,3],[258,5,258,11],[260,0,260,3],[260,5,260,11],[273,0,273,3],[273,5,273,11],[274,0,274,3],[274,5,274,11],[278,0,278,3],[278,5,278,11],[279,0,279,3],[279,5,279,11],[296,0,296,3],[296,5,296,11],[307,0,307,3],[307,5,307,11],[342,0,342,3],[342,5,342,11],[343,0,345,0],[349,0,349,3],[349,5,349,11],[350,0,350,3],[350,5,350,11],[359,0,359,3],[359,5,359,11],[360,0,360,3],[360,5,360,11]]}
["ZDJĘCIE","SAP","TYP","OPIS","CENA REUP PLN","Grupa rabatowa","Klasyfikacja logistyczna kod ABC","Informacje do zamówienia","Dodatkowe uwagi","Okres gwarancji (lat)","Cena REUP przedłużenia gw.","Kraj pochodzenia","Kod taryfy celnej","Waga netto (kg)"]
[]
["Centrala AVENAR 2000"]
[null,"F.01U.383.886","FPA-2000-SWM","Centrala z kontrolerem w wersji standard, montaż ścienny. \nW skład zestawu wchodzi: 1x FPE-2000-SPC, 1x BCM-000-B, 1x LSN 0300 A, 1x PRS-0002-C, 1x PRD-0004 A, 1x UPS 2416A, 3x FDP 0001 A, 1x HCP 0006 A, 1x FPO-5000-PSB-CH.",{"$f":"VLOOKUP(B4,'Fire EN 54'!$D$5:$H$508,5,0)","v":{"v":8848,"d":"8848.00"}},"5A","A",null,null,{"$f":"VLOOKUP(B4,'Fire EN 54'!$D$5:$I$508,6,0)","v":"5"},"-","PT",{"$f":"VLOOKUP(B4,'Fire EN 54 FX 4,704'!$D$5:$L$500,9,0)","v":8537109199},{"$f":"VLOOKUP(B4,'Fire EN 54 FX 4,704'!$D$5:$O$500,12,0)","v":{"v":19.7,"d":"19.70"}}]
[null,"F.01U.383.887","FPA-2000-SFM","Centrala z kontrolerem w wersji standard, montaż na ramie.\nW skład zestawu wchodzi: 1x FPE-2000-SPC, 1x BCM-000-B, 1x LSN 0300 A, 1x PRS-0002-C, 1x PRD-0004 A, 1x UPS 2416A, 3x FDP 0001 A, 1x CPH 0006 A, 1x FBH 0000 A",{"$f":"VLOOKUP(B5,'Fire EN 54'!$D$5:$H$508,5,0)","v":{"v":9513,"d":"9513.00"}},"5A","A",null,null,{"$f":"VLOOKUP(B5,'Fire EN 54'!$D$5:$I$508,6,0)","v":"5"},"-","PT",{"$f":"VLOOKUP(B5,'Fire EN 54 FX 4,704'!$D$5:$L$500,9,0)","v":8537109199},{"$f":"VLOOKUP(B5,'Fire EN 54 FX 4,704'!$D$5:$O$500,12,0)","v":{"v":22.8,"d":"22.80"}}]
[null,"F.01U.383.888","FPA-2000-PWM","Centrala z kontrolerem w wersji premium montaż ścienny\nW skład zestawu wchodzi: 1x FPE-2000-PPC, 1x BCM-000-B, 1x LSN 0300 A, 1x PRS-0002-C, 1x PRD-0004 A, 1x UPS 2416A, 3x FDP 0001 A, 1x HCP 0006 A, 1x FPO-5000-PSB-CH",{"$f":"VLOOKUP(B6,'Fire EN 54'!$D$5:$H$508,5,0)","v":{"v":11608,"d":"11608.00"}},"5A","A",null,null,{"$f":"VLOOKUP(B6,'Fire EN 54'!$D$5:$I$508,6,0)","v":"5"},"-","PT",{"$f":"VLOOKUP(B6,'Fire EN 54 FX 4,704'!$D$5:$L$500,9,0)","v":8537109199},{"$f":"VLOOKUP(B6,'Fire EN 54 FX 4,704'!$D$5:$O$500,12,0)","v":{"v":19.7,"d":"19.70"}}]
[null,"F.01U.383.893","FPA-2000-PFM","Centrala z kontrolerem w wersji premium, montaż na ramie\nW skład zestawu wchodzi: 1x FPE-2000-PPC, 1x BCM-000-B, 1x LSN 0300 A, 1x PRS-0002-C, 1x PRD-0004 A, 1x UPS 2416A, 3x FDP 0001 A, 1x CPH 0006 A, 1x FBH 0000 A",{"$f":"VLOOKUP(B7,'Fire EN 54'!$D$5:$H$508,5,0)","v":{"v":12244,"d":"12244.00"}},"5A","A",null,null,{"$f":"VLOOKUP(B7,'Fire EN 54'!$D$5:$I$508,6,0)","v":"5"},"-","PT",{"$f":"VLOOKUP(B7,'Fire EN 54 FX 4,704'!$D$5:$L$500,9,0)","v":8537109199},{"$f":"VLOOKUP(B7,'Fire EN 54 FX 4,704'!$D$5:$O$500,12,0)","v":{"v":22.8,"d":"22.80"}}]
["Centrala AVENAR 8000"]
["Kontroler główny centrali, licencje"]
[null,"F.01U.327.090","FPE-8000-SPC","Kontroler centrali, licencja standard",{"$f":"VLOOKUP(B10,'Fire EN 54'!$D$5:$H$508,5,0)","v":{"v":4026,"d":"4026.00"}},"5A","A",null,null,{"$f":"VLOOKUP(B10,'Fire EN 54'!$D$5:$I$508,6,0)","v":5},"-","PT",{"$f":"VLOOKUP(B10,'Fire EN 54 FX 4,704'!$D$5:$L$500,9,0)","v":8537109199},{"$f":"VLOOKUP(B10,'Fire EN 54 FX 4,704'!$D$5:$O$500,12,0)","v":{"v":3.191,"d":"3.19"}}]
[null,"F.01U.352.441","FPE-8000-PPC","Kontroler centrali, licencja premium",{"$f":"VLOOKUP(B11,'Fire EN 54'!$D$5:$H$508,5,0)","v":{"v":6915,"d":"6915.00"}},"5A","A",null,null,{"$f":"VLOOKUP(B11,'Fire EN 54'!$D$5:$I$508,6,0)","v":5},"-","PT",{"$f":"VLOOKUP(B11,'Fire EN 54 FX 4,704'!$D$5:$L$500,9,0)","v":8537109199},{"$f":"VLOOKUP(B11,'Fire EN 54 FX 4,704'!$D$5:$O$500,12,0)","v":{"v":3.191,"d":"3.19"}}]
["Nexospace FSE"]
[null,"F.01U.433.333","FPO-GATE","Bezpieczna brama sieciowa do NEXOSPACE FSE",{"$f":"VLOOKUP(B13,'Fire EN 54'!$D$5:$H$508,5,0)","v":{"v":4498,"d":"4498.00"}},"5A","N/a",null,null,{"$f":"VLOOKUP(B13,'Fire EN 54'!$D$5:$I$508,6,0)","v":"1"},"-","DE",{"$f":"VLOOKUP(B13,'Fire EN 54 FX 4,704'!$D$5:$L$500,9,0)","v":8517620000},{"$f":"VLOOKUP(B13,'Fire EN 54 FX 4,704'!$D$5:$O$500,12,0)","v":{"v":1.127,"d":"1.13"}}]
[null,"F.01U.435.428","FSL-BASIC-S","NEXOSPACE FSE Licencja podstawowa S (1 rok)",{"$f":"VLOOKUP(B14,'Fire EN 54'!$D$5:$H$508,5,0)","v":{"v":1497,"d":"1497.00"}},"5A","N/a","Roczna licencja na łączność <254 punktów","Punkt = ROP lub detektor adresowalny",{"$f":"VLOOKUP(B14,'Fire EN 54'!D9:I512,6,0)","v":"n.a."},"-","DE",{"$f":"VLOOKUP(B14,'Fire EN 54 FX 4,704'!$D$5:$L$500,9,0)","v":4911990000},{"$f":"VLOOKUP(B14,'Fire EN 54 FX 4,704'!$D$5:$O$500,12,0)","v":{"v":0,"d":"0.00"}}]
[null,"F.01U.435.594","FSL-BASIC-M","NEXOSPACE FSE Licencja podstawowa M (1 rok)",{"$f":"VLOOKUP(B15,'Fire EN 54'!$D$5:$H$508,5,0)","v":{"v":4510,"d":"4510.00"}},"5A","N/a","Roczna licencja na łączność 254 - 2000 punktów","Punkt = ROP lub detektor adresowalny",{"$f":"VLOOKUP(B15,'Fire EN 54'!D10:I513,6,0)","v":"n.a."},"-","DE",{"$f":"VLOOKUP(B15,'Fire EN 54 FX 4,704'!$D$5:$L$500,9,0)","v":4911990000},{"$f":"VLOOKUP(B15,'Fire EN 54 FX 4,704'!$D$5:$O$500,12,0)","v":{"v":0,"d":"0.00"}}]
[null,"F.01U.435.590","FSL-BASIC-L","NEXOSPACE FSE Licencja podstawowa L (1 rok)",{"$f":"VLOOKUP(B16,'Fire EN 54'!$D$5:$H$508,5,0)","v":{"v":7495,"d":"7495.00"}},"5A","N/a","Roczna licencja na łączność > 2000 punktów","Punkt = ROP lub detektor adresowalny",{"$f":"VLOOKUP(B16,'Fire EN 54'!D11:I514,6,0)","v":"n.a."},"-","DE",{"$f":"VLOOKUP(B16,'Fire EN 54 FX 4,704'!$D$5:$L$500,9,0)","v":4911990000},{"$f":"VLOOKUP(B16,'Fire EN 54 FX 4,704'!$D$5:$O$500,12,0)","v":{"v":0,"d":"0.00"}}]
["BACNet Server License"]
[null,"F.01U.428.678","FSM8000-BNSL","Licencja serwera BACnet na 5 lat",{"$f":"VLOOKUP(B18,'Fire EN 54'!$D$5:$H$508,5,0)","v":{"v":9596,"d":"9596.00"}},"5A","C",null,null,{"$f":"VLOOKUP(B18,'Fire EN 54'!$D$5:$I$508,6,0)","v":"n.a."},null,"DE",{"$f":"VLOOKUP(B18,'Fire EN 54 FX 4,704'!$D$5:$L$500,9,0)","v":"n.a."},{"$f":"VLOOKUP(B18,'Fire EN 54 FX 4,704'!$D$5:$O$500,12,0)","v":"n.a."}]
[null,"F.01U.428.679","FSM8000-BNSTL","Licencja próbna serwera BACnet na 30 dni",{"$f":"VLOOKUP(B19,'Fire EN 54'!$D$5:$H$508,5,0)","v":{"v":216,"d":"216.00"}},"5A","C",null,null,{"$f":"VLOOKUP(B19,'Fire EN 54'!$D$5:$I$508,6,0)","v":"n.a."},null,"DE",{"$f":"VLOOKUP(B19,'Fire EN 54 FX 4,704'!$D$5:$L$500,9,0)","v":"n.a."},{"$f":"VLOOKUP(B19,'Fire EN 54 FX 4,704'!$D$5:$O$500,12,0)","v":"n.a."}]
["Moduły funkcjonalne central"]
[null,"F.01U.081.384","BCM-0000-B","Moduł kontroli baterii",{"$f":"VLOOKUP(B21,'Fire EN 54'!$D$5:$H$508,5,0)","v":{"v":1036,"d":"1036.00"}},"5A",1,null,null,{"$f":"VLOOKUP(B21,'Fire EN 54'!$D$5:$I$508,6,0)","v":5},"-","CN",{"$f":"VLOOKUP(B21,'Fire EN 54 FX 4,704'!$D$5:$L$500,9,0)","v":8537109199},{"$f":"VLOOKUP(B21,'Fire EN 54 FX 4,704'!$D$5:$O$500,12,0)","v":"0.342"}]
[null,"4.998.137.262","ANI 0016 A","Moduł wskaźników diodowych",{"$f":"VLOOKUP(B22,'Fire EN 54'!$D$5:$H$508,5,0)","v":{"v":622,"d":"622.00"}},"5A","A",null,null,{"$f":"VLOOKUP(B22,'Fire EN 54'!$D$5:$I$508,6,0)","v":5},"-","CN",{"$f":"VLOOKUP(B22,'Fire EN 54 FX 4,704'!$D$5:$L$500,9,0)","v":8537109199},{"$f":"VLOOKUP(B22,'Fire EN 54 FX 4,704'!$D$5:$O$500,12,0)","v":"0.26"}]
[null,"4.998.137.265","RML 0008 A","Moduł 8 wyjść przekaźnikowych niskonapięciowych",{"$f":"VLOOKUP(B23,'Fire EN 54'!$D$5:$H$508,5,0)","v":{"v":829,"d":"829.00"}},"5A",1,null,null,{"$f":"VLOOKUP(B23,'Fire EN 54'!$D$5:$I$508,6,0)","v":5},"-","CN",{"$f":"VLOOKUP(B23,'Fire EN 54 FX 4,704'!$D$5:$L$500,9,0)","v":8537109199},{"$f":"VLOOKUP(B23,'Fire EN 54 FX 4,704'!$D$5:$O$500,12,0)","v":"0.306"}]
[null,"4.998.137.266","IOS 0020 A","Moduł komunikacyjny (20mA i RS232)",{"$f":"VLOOKUP(B24,'Fire EN 54'!$D$5:$H$508,5,0)","v":{"v":2255,"d":"2255.00"}},"5A",1,null,null,{"$f":"VLOOKUP(B24,'Fire EN 54'!$D$5:$I$508,6,0)","v":5},"-","CN",{"$f":"VLOOKUP(B24,'Fire EN 54 FX 4,704'!$D$5:$L$500,9,0)","v":8537109199},{"$f":"VLOOKUP(B24,'Fire EN 54 FX 4,704'!$D$5:$O$500,12,0)","v":"0.594"}]
[null,"4.998.137.267","IOS 0232 A","Moduł komunikacyjny (2xRS232)",{"$f":"VLOOKUP(B25,'Fire EN 54'!$D$5:$H$508,5,0)","v":{"v":1243,"d":"1243.00"}},"5A","A",null,null,{"$f":"VLOOKUP(B25,'Fire EN 54'!$D$5:$I$508,6,0)","v":5},"-","CN",{"$f":"VLOOKUP(B25,'Fire EN 54 FX 4,704'!$D$5:$L$500,9,0)","v":8537109199},{"$f":"VLOOKUP(B25,'Fire EN 54 FX 4,704'!$D$5:$O$500,12,0)","v":"0.233"}]
[null,"4.998.137.269","IOP 0008 A","Moduł 8 wejść i 8 wyjść OC",{"$f":"VLOOKUP(B26,'Fire EN 54'!$D$5:$H$508,5,0)","v":{"v":1138,"d":"1138.00"}},"5A",1,null,null,{"$f":"VLOOKUP(B26,'Fire EN 54'!$D$5:$I$508,6,0)","v":5},"-","CN",{"$f":"VLOOKUP(B26,'Fire EN 54 FX 4,704'!$D$5:$L$500,9,0)","v":8537109199},{"$f":"VLOOKUP(B26,'Fire EN 54 FX 4,704'!$D$5:$O$500,12,0)","v":"0.299"}]
[null,"4.998.137.270","CZM 0004 A","Moduł 4 stref konwencjonalnych",{"$f":"VLOOKUP(B27,'Fire EN 54'!$D$5:$H$508,5,0)","v":{"v":2247,"d":"2247.00"}},"5A",1,null,null,{"$f":"VLOOKUP(B27,'Fire EN 54'!$D$5:$I$508,6,0)","v":5},"-","CN",{"$f":"VLOOKUP(B27,'Fire EN 54 FX 4,704'!$D$5:$L$500,9,0)","v":8537109199},{"$f":"VLOOKUP(B27,'Fire EN 54 FX 4,704'!$D$5:$O$500,12,0)","v":"0.333"}]
[null,"4.998.137.274","RMH 0002 A","Moduł 2 wyjść przekaźnikowych wysokonapięciowych",{"$f":"VLOOKUP(B28,'Fire EN 54'!$D$5:$H$508,5,0)","v":{"v":1897,"d":"1897.00"}},"5A","D","Planowane zakończenie produkcji 31.03.2026.","EOL 31.06.2026",{"$f":"VLOOKUP(B28,'Fire EN 54'!$D$5:$I$508,6,0)","v":5},"-","CN",{"$f":"VLOOKUP(B28,'Fire EN 54 FX 4,704'!$D$5:$L$500,9,0)","v":8537109199},{"$f":"VLOOKUP(B28,'Fire EN 54 FX 4,704'!$D$5:$O$500,12,0)","v":"0.31"}]
[null,"4.998.137.275","NZM 0002 A","Moduł 2 linii sygnalizatorów",{"$f":"VLOOKUP(B29,'Fire EN 54'!$D$5:$H$508,5,0)","v":{"v":1658,"d":"1658.00"}},"5A",1,null,null,{"$f":"VLOOKUP(B29,'Fire EN 54'!$D$5:$I$508,6,0)","v":5},"-","CN",{"$f":"VLOOKUP(B29,'Fire EN 54 FX 4,704'!$D$5:$L$500,9,0)","v":8537109199},{"$f":"VLOOKUP(B29,'Fire EN 54 FX 4,704'!$D$5:$O$500,12,0)","v":"0.306"}]
[null,"F.01U.028.289","FPE-5000-UGM","Moduł komunikacyjny",{"$f":"VLOOKUP(B30,'Fire EN 54'!$D$5:$H$508,5,0)","v":{"v":2188,"d":"2188.00"}},"5A","A",null,null,{"$f":"VLOOKUP(B30,'Fire EN 54'!$D$5:$I$508,6,0)","v":5},"-","CN",{"$f":"VLOOKUP(B30,'Fire EN 54 FX 4,704'!$D$5:$L$500,9,0)","v":8537109199},{"$f":"VLOOKUP(B30,'Fire EN 54 FX 4,704'!$D$5:$O$500,12,0)","v":"0.27"}]
[null,"4.998.137.277","LSN 0300 A","Moduł pętli LSN o obciążalności 300mA",{"$f":"VLOOKUP(B31,'Fire EN 54'!$D$5:$H$508,5,0)","v":{"v":2422,"d":"2422.00"}},"5A",1,null,null,{"$f":"VLOOKUP(B31,'Fire EN 54'!$D$5:$I$508,6,0)","v":5},"-","CN",{"$f":"VLOOKUP(B31,'Fire EN 54 FX 4,704'!$D$5:$L$500,9,0)","v":8538909999},{"$f":"VLOOKUP(B31,'Fire EN 54 FX 4,704'!$D$5:$O$500,12,0)","v":"0.306"}]
[null,"4.998.137.278","LSN 1500 A","Moduł pętli LSN o obciążalności 1500mA",{"$f":"VLOOKUP(B32,'Fire EN 54'!$D$5:$H$508,5,0)","v":{"v":4814,"d":"4814.00"}},"5A","A",null,null,{"$f":"VLOOKUP(B32,'Fire EN 54'!$D$5:$I$508,6,0)","v":5},"-","CN",{"$f":"VLOOKUP(B32,'Fire EN 54 FX 4,704'!$D$5:$L$500,9,0)","v":8538909999},{"$f":"VLOOKUP(B32,'Fire EN 54 FX 4,704'!$D$5:$O$500,12,0)","v":"0.68"}]
["Szyny przyłączeniowe central"]
[null,"F.01U.284.903","PRS-0002-C","Szyna przyłączeniowa krótka",{"$f":"VLOOKUP(B34,'Fire EN 54'!$D$5:$H$508,5,0)","v":{"v":281,"d":"281.00"}},"5A","A",null,null,{"$f":"VLOOKUP(B34,'Fire EN 54'!$D$5:$I$508,6,0)","v":5},{"$f":"VLOOKUP(C34,#REF!,5,0)","v":{"$error":"#REF!"}},"CN",{"$f":"VLOOKUP(B34,'Fire EN 54 FX 4,704'!$D$5:$L$500,9,0)","v":8536901000},{"$f":"VLOOKUP(B34,'Fire EN 54 FX 4,704'!$D$5:$O$500,12,0)","v":"0.45"}]
[null,"4.998.137.280","PRD 0004 A","Szyna przyłączeniowa długa",{"$f":"VLOOKUP(B35,'Fire EN 54'!$D$5:$H$508,5,0)","v":{"v":705,"d":"705.00"}},"5A",1,null,null,{"$f":"VLOOKUP(B35,'Fire EN 54'!$D$5:$I$508,6,0)","v":5},"-","CN",{"$f":"VLOOKUP(B35,'Fire EN 54 FX 4,704'!$D$5:$L$500,9,0)","v":8536901000},{"$f":"VLOOKUP(B35,'Fire EN 54 FX 4,704'!$D$5:$O$500,12,0)","v":"0.72"}]
["Obudowy do instalacji na ramach montażowych central"]
[null,"4.998.137.290","CPH 0006 A","Obudowa podstawowa na 6 modułów, 2 baterie 12V/40Ah, 1 uchwyt pojedynczy zasilacza PSB 1001 A (cena obejmuje uchwyt zasilacza pojedynczy PSB 1001 A)",{"$f":"VLOOKUP(B37,'Fire EN 54'!$D$5:$H$508,5,0)","v":{"v":2467,"d":"2467.00"}},"5A",1,null,null,{"$f":"VLOOKUP(B37,'Fire EN 54'!$D$5:$I$508,6,0)","v":5},"-","CN",{"$f":"VLOOKUP(B37,'Fire EN 54 FX 4,704'!$D$5:$L$500,9,0)","v":8538909999},{"$f":"VLOOKUP(B37,'Fire EN 54 FX 4,704'!$D$5:$O$500,12,0)","v":"12.34"}]
[null,"4.998.137.291","MPH 0010 A","Obudowa podstawowa na 10 modułów",{"$f":"VLOOKUP(B38,'Fire EN 54'!$D$5:$H$508,5,0)","v":{"v":3108,"d":"3108.00"}},"5A",1,null,null,{"$f":"VLOOKUP(B38,'Fire EN 54'!$D$5:$I$508,6,0)","v":5},"-","CN",{"$f":"VLOOKUP(B38,'Fire EN 54 FX 4,704'!$D$5:$L$500,9,0)","v":8538909999},{"$f":"VLOOKUP(B38,'Fire EN 54 FX 4,704'!$D$5:$O$500,12,0)","v":"13.85"}]
[null,"4.998.137.292","EPH 0012 A","Obudowa rozbudów na 12 modułów",{"$f":"VLOOKUP(B39,'Fire EN 54'!$D$5:$H$508,5,0)","v":{"v":5281,"d":"5281.00"}},"5A",1,null,null,{"$f":"VLOOKUP(B39,'Fire EN 54'!$D$5:$I$508,6,0)","v":5},"-","CN",{"$f":"VLOOKUP(B39,'Fire EN 54 FX 4,704'!$D$5:$L$500,9,0)","v":8538909999},{"$f":"VLOOKUP(B39,'Fire EN 54 FX 4,704'!$D$5:$O$500,12,0)","v":"14.55"}]
[null,"4.998.137.293","PSF 0002 A","Obudowa zasilania mała do instalacji dwóch baterii 12V/40Ah oraz jednego uchwytu zasilacza pojedynczego PSB 1001 A (cena obejmuje uchwyt zasilacza pojedynczy PSB 1001 A)",{"$f":"VLOOKUP(B40,'Fire EN 54'!$D$5:$H$508,5,0)","v":{"v":1667,"d":"1667.00"}},"5A",1,null,null,{"$f":"VLOOKUP(B40,'Fire EN 54'!$D$5:$I$508,6,0)","v":5},"-","CN",{"$f":"VLOOKUP(B40,'Fire EN 54 FX 4,704'!$D$5:$L$500,9,0)","v":8538909999},{"$f":"VLOOKUP(B40,'Fire EN 54 FX 4,704'!$D$5:$O$500,12,0)","v":"7.723"}]
[null,"4.998.137.294","PMF 0004 A","Obudowa zasilania średnia do instalacji czterech baterii 12V/40Ah oraz jednego uchwytu zasilacza pojedynczego PSB 1001 A (cena obejmuje uchwyt zasilacza pojedynczy PSB 1001 A)",{"$f":"VLOOKUP(B41,'Fire EN 54'!$D$5:$H$508,5,0)","v":{"v":1927,"d":"1927.00"}},"5A",1,null,null,{"$f":"VLOOKUP(B41,'Fire EN 54'!$D$5:$I$508,6,0)","v":5},"-","CN",{"$f":"VLOOKUP(B41,'Fire EN 54 FX 4,704'!$D$5:$L$500,9,0)","v":8538909999},{"$f":"VLOOKUP(B41,'Fire EN 54 FX 4,704'!$D$5:$O$500,12,0)","v":"12.132"}]
[null,"4.998.147.119","USF 0000 A","Obudowa mała uniwersalna",{"$f":"VLOOKUP(B42,'Fire EN 54'!$D$5:$H$508,5,0)","v":{"v":1603,"d":"1603.00"}},"5A","A",null,null,{"$f":"VLOOKUP(B42,'Fire EN 54'!$D$5:$I$508,6,0)","v":5},"-","CN",{"$f":"VLOOKUP(B42,'Fire EN 54 FX 4,704'!$D$5:$L$500,9,0)","v":8538909999},{"$f":"VLOOKUP(B42,'Fire EN 54 FX 4,704'!$D$5:$O$500,12,0)","v":"7.489"}]
[null,"F.01U.266.845","FPM-5000-KMC","Zestaw montażowy dla media konwertera",{"$f":"VLOOKUP(B43,'Fire EN 54'!$D$5:$H$508,5,0)","v":{"v":2084,"d":"2084.00"}},"5A","A",null,null,{"$f":"VLOOKUP(B43,'Fire EN 54'!$D$5:$I$508,6,0)","v":5},"-","DE",{"$f":"VLOOKUP(B43,'Fire EN 54 FX 4,704'!$D$5:$L$500,9,0)","v":85189000},{"$f":"VLOOKUP(B43,'Fire EN 54 FX 4,704'!$D$5:$O$500,12,0)","v":"0.86"}]
[null,"4.998.137.296","FBH 0000 A","Rama montażowa duża",{"$f":"VLOOKUP(B44,'Fire EN 54'!$D$5:$H$508,5,0)","v":{"v":839,"d":"839.00"}},"5A",1,null,null,{"$f":"VLOOKUP(B44,'Fire EN 54'!$D$5:$I$508,6,0)","v":5},"-","CN",{"$f":"VLOOKUP(B44,'Fire EN 54 FX 4,704'!$D$5:$L$500,9,0)","v":3926909790},{"$f":"VLOOKUP(B44,'Fire EN 54 FX 4,704'!$D$5:$O$500,12,0)","v":"4.822"}]
[null,"4.998.137.297","FMH 0000 A","Rama montażowa średnia",{"$f":"VLOOKUP(B45,'Fire EN 54'!$D$5:$H$508,5,0)","v":{"v":617,"d":"617.00"}},"5A",1,null,null,{"$f":"VLOOKUP(B45,'Fire EN 54'!$D$5:$I$508,6,0)","v":5},"-","CN",{"$f":"VLOOKUP(B45,'Fire EN 54 FX 4,704'!$D$5:$L$500,9,0)","v":3926909790},{"$f":"VLOOKUP(B45,'Fire EN 54 FX 4,704'!$D$5:$O$500,12,0)","v":"4.137"}]
[null,"4.998.137.298","FSH 0000 A","Rama montażowa mała",{"$f":"VLOOKUP(B46,'Fire EN 54'!$D$5:$H$508,5,0)","v":{"v":493,"d":"493.00"}},"5A","A",null,null,{"$f":"VLOOKUP(B46,'Fire EN 54'!$D$5:$I$508,6,0)","v":5},"-","CN",{"$f":"VLOOKUP(B46,'Fire EN 54 FX 4,704'!$D$5:$L$500,9,0)","v":3926909790},{"$f":"VLOOKUP(B46,'Fire EN 54 FX 4,704'!$D$5:$O$500,12,0)","v":"2.362"}]
[null,"4.998.139.498","FRB 0019 A","19\" Zestaw umożliwiający instalację w szafach rack 19\" obudów: CPH 0006 A, MPH 0010 A, EPH 0012 A",{"$f":"VLOOKUP(B47,'Fire EN 54'!$D$5:$H$508,5,0)","v":{"v":663,"d":"663.00"}},"5A","A",null,null,{"$f":"VLOOKUP(B47,'Fire EN 54'!$D$5:$I$508,6,0)","v":5},"-","CN",{"$f":"VLOOKUP(B47,'Fire EN 54 FX 4,704'!$D$5:$L$500,9,0)","v":7326909890},{"$f":"VLOOKUP(B47,'Fire EN 54 FX 4,704'!$D$5:$O$500,12,0)","v":"4.813"}]
[null,"4.998.139.499","FRM 0019 A","19\" Zestaw umożliwiający instalację w szafach rack 19\" obudowy PMF 0004 A",{"$f":"VLOOKUP(B48,'Fire EN 54'!$D$5:$H$508,5,0)","v":{"v":518,"d":"518.00"}},"5A","A",null,null,{"$f":"VLOOKUP(B48,'Fire EN 54'!$D$5:$I$508,6,0)","v":5},"-","CN",{"$f":"VLOOKUP(B48,'Fire EN 54 FX 4,704'!$D$5:$L$500,9,0)","v":7326909890},{"$f":"VLOOKUP(B48,'Fire EN 54 FX 4,704'!$D$5:$O$500,12,0)","v":"4.778"}]
[null,"4.998.139.500","FRS 0019 A","19\" Zestaw umożliwiający instalację w szafach rack 19\" obudów PSF 0002A i USF 0000 A",{"$f":"VLOOKUP(B49,'Fire EN 54'!$D$5:$H$508,5,0)","v":{"v":456,"d":"456.00"}},"5A","A",null,null,{"$f":"VLOOKUP(B49,'Fire EN 54'!$D$5:$I$508,6,0)","v":5},"-","CN",{"$f":"VLOOKUP(B49,'Fire EN 54 FX 4,704'!$D$5:$L$500,9,0)","v":3926909790},{"$f":"VLOOKUP(B49,'Fire EN 54 FX 4,704'!$D$5:$O$500,12,0)","v":"3.14"}]
[null,"F.01U.500.374","FDP 0001 A","Zaślepka pustych slotów modułów",{"$f":"VLOOKUP(B50,'Fire EN 54'!$D$5:$H$508,5,0)","v":{"v":83,"d":"83.00"}},"5A",1,null,null,{"$f":"VLOOKUP(B50,'Fire EN 54'!$D$5:$I$508,6,0)","v":5},"-","CN",{"$f":"VLOOKUP(B50,'Fire EN 54 FX 4,704'!$D$5:$L$500,9,0)","v":3926909790},{"$f":"VLOOKUP(B50,'Fire EN 54 FX 4,704'!$D$5:$O$500,12,0)","v":"0.1"}]
[null,"F.01U.513.251","FPO-5000-EB","Szyna uziemiająca",{"$f":"VLOOKUP(B51,'Fire EN 54'!$D$5:$H$508,5,0)","v":{"v":414,"d":"414.00"}},"5A","A",null,null,{"$f":"VLOOKUP(B51,'Fire EN 54'!$D$5:$I$508,6,0)","v":5},"-","CN",{"$f":"VLOOKUP(B51,'Fire EN 54 FX 4,704'!$D$5:$L$500,9,0)","v":7326909890},{"$f":"VLOOKUP(B51,'Fire EN 54 FX 4,704'!$D$5:$O$500,12,0)","v":"0.111"}]
["Obudowy do monatażu naściennego central"]
[null,"4.998.137.285","HCP 0006 A","Obudowa podstawowa 6 modułów, 2 baterie 12V/28Ah oraz uchwyt dwóch zasilaczy CPB 1002 A (zamawiany dodatkowo)",{"$f":"VLOOKUP(B53,'Fire EN 54'!$D$5:$H$508,5,0)","v":{"v":2072,"d":"2072.00"}},"5A",1,null,null,{"$f":"VLOOKUP(B53,'Fire EN 54'!$D$5:$I$508,6,0)","v":5},"-","CN",{"$f":"VLOOKUP(B53,'Fire EN 54 FX 4,704'!$D$5:$L$500,9,0)","v":8529904900},{"$f":"VLOOKUP(B53,'Fire EN 54 FX 4,704'!$D$5:$O$500,12,0)","v":"13.581"}]
[null,"4.998.137.286","HBC 0010 A","Obudowa podstawowa na 10 modułów, 2 baterie 12V/28Ah oraz uchwyt dwóch zasilaczy CPB 1002 A (zamawiany dodatkowo)",{"$f":"VLOOKUP(B54,'Fire EN 54'!$D$5:$H$508,5,0)","v":{"v":3108,"d":"3108.00"}},"5A",1,null,null,{"$f":"VLOOKUP(B54,'Fire EN 54'!$D$5:$I$508,6,0)","v":5},"-","CN",{"$f":"VLOOKUP(B54,'Fire EN 54 FX 4,704'!$D$5:$L$500,9,0)","v":8529904900},{"$f":"VLOOKUP(B54,'Fire EN 54 FX 4,704'!$D$5:$O$500,12,0)","v":"17.11"}]
[null,"4.998.137.287","HBE 0012 A","Obudowa rozszerzeń na 12 modułów, 2 baterie 12V/28Ah oraz uchwyt dwóch zasilaczy CPB 1002 A(zamawiamy dodatkowo)",{"$f":"VLOOKUP(B55,'Fire EN 54'!$D$5:$H$508,5,0)","v":{"v":5281,"d":"5281.00"}},"5A","A",null,null,{"$f":"VLOOKUP(B55,'Fire EN 54'!$D$5:$I$508,6,0)","v":5},"-","CN",{"$f":"VLOOKUP(B55,'Fire EN 54 FX 4,704'!$D$5:$L$500,9,0)","v":8529904900},{"$f":"VLOOKUP(B55,'Fire EN 54 FX 4,704'!$D$5:$O$500,12,0)","v":"18.144"}]
[null,"4.998.137.288","PSS 0002 A","Obudowa zasilania mała (może zostać wyposażona alternatywnie w: a) dwie baterie 12V/28Ah oraz pojedynczy uchwyt zasilacza PSB 1001 A b) uchwyt zasilacza podwójny PSB 1002 A c) płytę montażową HMP 0002 A)",{"$f":"VLOOKUP(B56,'Fire EN 54'!$D$5:$H$508,5,0)","v":{"v":2291,"d":"2291.00"}},"5A","A",null,null,{"$f":"VLOOKUP(B56,'Fire EN 54'!$D$5:$I$508,6,0)","v":5},"-","CN",{"$f":"VLOOKUP(B56,'Fire EN 54 FX 4,704'!$D$5:$L$500,9,0)","v":3926909790},{"$f":"VLOOKUP(B56,'Fire EN 54 FX 4,704'!$D$5:$O$500,12,0)","v":"7.452"}]
[null,"4.998.137.289","PSB 0004 A","Obudowa zasilania duża (może zostać wyposażona alternatywnie w: a) cztery baterie 12V/28 Ah oraz uchwyt zasilacza pojedynczy  PSB 1001 A b) dwie baterie 12V/28Ah oraz uchwyt zasilacza podwójny PSB 1002 A c) dwie baterie 12V/28Ah, uchwyt zasilacza podwójny PSB 1002 A oraz dystrybutor HPD 0000 A d) dwie baterie 12V/28Ah, uchwyt zasilacza podwójny PSB 1002 A oraz płytę montażową HMP 0001 A)",{"$f":"VLOOKUP(B57,'Fire EN 54'!$D$5:$H$508,5,0)","v":{"v":3108,"d":"3108.00"}},"5A","A",null,null,{"$f":"VLOOKUP(B57,'Fire EN 54'!$D$5:$I$508,6,0)","v":5},"-","CN",{"$f":"VLOOKUP(B57,'Fire EN 54 FX 4,704'!$D$5:$L$500,9,0)","v":3926909790},{"$f":"VLOOKUP(B57,'Fire EN 54 FX 4,704'!$D$5:$O$500,12,0)","v":"12.511"}]
["Zestawy kabli central"]
[null,"F.01U.500.367","UPS 2416 A","Zasilacz 24V/6A",{"$f":"VLOOKUP(B59,'Fire EN 54'!$D$5:$H$508,5,0)","v":{"v":2031,"d":"2031.00"}},"5A",1,null,null,{"$f":"VLOOKUP(B59,'Fire EN 54'!$D$5:$I$508,6,0)","v":5},"-","CN",{"$f":"VLOOKUP(B59,'Fire EN 54 FX 4,704'!$D$5:$L$500,9,0)","v":8504403090},{"$f":"VLOOKUP(B59,'Fire EN 54 FX 4,704'!$D$5:$O$500,12,0)","v":"0.97"}]
[null,"4.998.153.243","CPB 0000 A","Zestaw kabli połączeniowych pomiędzy modułem BCM a zasilaczem UPS (długość 150 cm) ",{"$f":"VLOOKUP(B60,'Fire EN 54'!$D$5:$H$508,5,0)","v":{"v":104,"d":"104.00"}},"5A","A",null,null,{"$f":"VLOOKUP(B60,'Fire EN 54'!$D$5:$I$508,6,0)","v":5},"-","CN",{"$f":"VLOOKUP(B60,'Fire EN 54 FX 4,704'!$D$5:$L$500,9,0)","v":8544429090},{"$f":"VLOOKUP(B60,'Fire EN 54 FX 4,704'!$D$5:$O$500,12,0)","v":"0.198"}]
[null,"F.01U.078.858","FPO-5000-PSB1","Uchwyt zasilacza pojedynczy (do obudów zasilania do montażu naściennego: PSS 0002 A oraz PSB 0004 A) ",{"$f":"VLOOKUP(B61,'Fire EN 54'!$D$5:$H$508,5,0)","v":{"v":456,"d":"456.00"}},"5A","A",null,null,{"$f":"VLOOKUP(B61,'Fire EN 54'!$D$5:$I$508,6,0)","v":5},"-","CN",{"$f":"VLOOKUP(B61,'Fire EN 54 FX 4,704'!$D$5:$L$500,9,0)","v":3926909790},{"$f":"VLOOKUP(B61,'Fire EN 54 FX 4,704'!$D$5:$O$500,12,0)","v":"1.03"}]
[null,"F.01U.078.860","FPO-5000-PSB-CH","Uchwyt zasilacza podwójny (do obudów do montażu naściennego: HCP 0006 A, HBC 0010 A oraz HBE 0012 A)",{"$f":"VLOOKUP(B62,'Fire EN 54'!$D$5:$H$508,5,0)","v":{"v":580,"d":"580.00"}},"5A",1,null,null,{"$f":"VLOOKUP(B62,'Fire EN 54'!$D$5:$I$508,6,0)","v":5},"-","CN",{"$f":"VLOOKUP(B62,'Fire EN 54 FX 4,704'!$D$5:$L$500,9,0)","v":3926909790},{"$f":"VLOOKUP(B62,'Fire EN 54 FX 4,704'!$D$5:$O$500,12,0)","v":"0.798"}]
["Zestawy kabli central"]
[null,"4.998.153.244","CBB 0000 A","Zestaw kabli połączeniowych (moduł BCM/baterie - 180 cm; bateria/bateria - 17cm) Wykorzystywane, gdy baterie są umieszczone w oddzielnej obudowie)",{"$f":"VLOOKUP(B64,'Fire EN 54'!$D$5:$H$508,5,0)","v":{"v":135,"d":"135.00"}},"5A",1,null,null,{"$f":"VLOOKUP(B64,'Fire EN 54'!$D$5:$I$508,6,0)","v":5},"-","CN",{"$f":"VLOOKUP(B64,'Fire EN 54 FX 4,704'!$D$5:$L$500,9,0)","v":8544429090},{"$f":"VLOOKUP(B64,'Fire EN 54 FX 4,704'!$D$5:$O$500,12,0)","v":"0.198"}]
[null,"F.01U.349.391","FPE-8000-CRP","Zestaw kabli do redundantnego połączenia dwóch kontrolerów centrali AVENAR (do systemów o pojemności powyżej 512 elementów)  ",{"$f":"VLOOKUP(B65,'Fire EN 54'!$D$5:$H$508,5,0)","v":{"v":350,"d":"350.00"}},"5A","A",null,null,{"$f":"VLOOKUP(B65,'Fire EN 54'!$D$5:$I$508,6,0)","v":5},"-","PT",{"$f":"VLOOKUP(B65,'Fire EN 54 FX 4,704'!$D$5:$L$500,9,0)","v":8544429090},{"$f":"VLOOKUP(B65,'Fire EN 54 FX 4,704'!$D$5:$O$500,12,0)","v":{"v":0.642,"d":"0.64"}}]
[null,"F.01U.349.392","FPE-8000-CRK","Zestaw do podłączenia wyniesionego pola obsługi AVENAR jako redudancji centrali AVENAR 8000.",{"$f":"VLOOKUP(B66,'Fire EN 54'!$D$5:$H$508,5,0)","v":{"v":210,"d":"210.00"}},"5A","A",null,null,{"$f":"VLOOKUP(B66,'Fire EN 54'!$D$5:$I$508,6,0)","v":5},"-","PT",{"$f":"VLOOKUP(B66,'Fire EN 54 FX 4,704'!$D$5:$L$500,9,0)","v":8544429090},{"$f":"VLOOKUP(B66,'Fire EN 54 FX 4,704'!$D$5:$O$500,12,0)","v":{"v":0.258,"d":"0.26"}}]
["Akcesoria central"]
[null,"F.01U.266.844","FPM-5000-KES","Zestaw montażowy do instalacji przełącznika Ethernet\nlub konwertera transmisji w obudowach USF 0000 A\nlub PSS 0002 A.",{"$f":"VLOOKUP(B68,'Fire EN 54'!$D$5:$H$508,5,0)","v":{"v":3678,"d":"3678.00"}},"5A","A",null,null,{"$f":"VLOOKUP(B68,'Fire EN 54'!$D$5:$I$508,6,0)","v":5},"-","DE",{"$f":"VLOOKUP(B68,'Fire EN 54 FX 4,704'!$D$5:$L$500,9,0)","v":8302500000},{"$f":"VLOOKUP(B68,'Fire EN 54 FX 4,704'!$D$5:$O$500,12,0)","v":"2.77"}]
[null,"F.01U.265.641","EL1141-10B-BH","Światłowodowy konwerter Ethernet MM",{"$f":"VLOOKUP(B69,'Fire EN 54'!$D$5:$H$508,5,0)","v":{"v":4443,"d":"4443.00"}},"5A","A",null,null,{"$f":"VLOOKUP(B69,'Fire EN 54'!$D$5:$I$508,6,0)","v":"3"},"-","DE",{"$f":"VLOOKUP(B69,'Fire EN 54 FX 4,704'!$D$5:$L$500,9,0)","v":8504409090},{"$f":"VLOOKUP(B69,'Fire EN 54 FX 4,704'!$D$5:$O$500,12,0)","v":"0.58"}]
[null,"F.01U.265.643","EL1141-B0B-BH","Światłowodowy konwerter Ethernet SM",{"$f":"VLOOKUP(B70,'Fire EN 54'!$D$5:$H$508,5,0)","v":{"v":6173,"d":"6173.00"}},"5A","A",null,null,{"$f":"VLOOKUP(B70,'Fire EN 54'!$D$5:$I$508,6,0)","v":"3"},"-","DE",{"$f":"VLOOKUP(B70,'Fire EN 54 FX 4,704'!$D$5:$L$500,9,0)","v":8504409090},{"$f":"VLOOKUP(B70,'Fire EN 54 FX 4,704'!$D$5:$O$500,12,0)","v":"0.58"}]
["Wyniesione pole obsługi"]
[null,"F.01U.327.092","FPE-8000-FMR","Klawiatura wyniesiona - wersja AVENAR",{"$f":"VLOOKUP(B72,'Fire EN 54'!$D$5:$H$508,5,0)","v":{"v":7090,"d":"7090.00"}},"5A","A",null,null,{"$f":"VLOOKUP(B72,'Fire EN 54'!$D$5:$I$508,6,0)","v":"5"},"-","PT",{"$f":"VLOOKUP(B72,'Fire EN 54 FX 4,704'!$D$5:$L$500,9,0)","v":8537109199},{"$f":"VLOOKUP(B72,'Fire EN 54 FX 4,704'!$D$5:$O$500,12,0)","v":{"v":3.121,"d":"3.12"}}]
["Czujki punktowe LSNi"]
["Seria 520"]
[null,"F.01U.510.149","FAP-O 520","Czujka optyczna dekoracyjna Lsn, biała",{"$f":"VLOOKUP(B75,'Fire EN 54'!$D$5:$H$508,5,0)","v":{"v":965,"d":"965.00"}},"5A","A",null,null,{"$f":"VLOOKUP(B75,'Fire EN 54'!$D$5:$I$508,6,0)","v":"5"},"-","CN",{"$f":"VLOOKUP(B75,'Fire EN 54 FX 4,704'!$D$5:$L$500,9,0)","v":8531103000},{"$f":"VLOOKUP(B75,'Fire EN 54 FX 4,704'!$D$5:$O$500,12,0)","v":"0.170"}]
[null,"F.01U.510.151","FAP-OC 520","Czujka optyczo-chemiczna Lsn, biała",{"$f":"VLOOKUP(B76,'Fire EN 54'!$D$5:$H$508,5,0)","v":{"v":1544,"d":"1544.00"}},"5A","A",null,null,{"$f":"VLOOKUP(B76,'Fire EN 54'!$D$5:$I$508,6,0)","v":"5"},"-","CN",{"$f":"VLOOKUP(B76,'Fire EN 54 FX 4,704'!$D$5:$L$500,9,0)","v":8531103000},{"$f":"VLOOKUP(B76,'Fire EN 54 FX 4,704'!$D$5:$O$500,12,0)","v":"0.180"}]
[null,"F.01U.510.161","FAP-O 520-P","Czujka optyczna dekoracyjna Lsn, przezroczysta",{"$f":"VLOOKUP(B77,'Fire EN 54'!$D$5:$H$508,5,0)","v":{"v":1094,"d":"1094.00"}},"5A","A",null,null,{"$f":"VLOOKUP(B77,'Fire EN 54'!$D$5:$I$508,6,0)","v":"5"},"-","CN",{"$f":"VLOOKUP(B77,'Fire EN 54 FX 4,704'!$D$5:$L$500,9,0)","v":8531103000},{"$f":"VLOOKUP(B77,'Fire EN 54 FX 4,704'!$D$5:$O$500,12,0)","v":"0.170"}]
[null,"F.01U.510.162","FAP-OC 520-P","Czujka optyczno-chemiczna Lsn, przezroczysta ",{"$f":"VLOOKUP(B78,'Fire EN 54'!$D$5:$H$508,5,0)","v":{"v":1577,"d":"1577.00"}},"5A","A",null,null,{"$f":"VLOOKUP(B78,'Fire EN 54'!$D$5:$I$508,6,0)","v":"5"},"-","CN",{"$f":"VLOOKUP(B78,'Fire EN 54 FX 4,704'!$D$5:$L$500,9,0)","v":8531103000},{"$f":"VLOOKUP(B78,'Fire EN 54 FX 4,704'!$D$5:$O$500,12,0)","v":"0.180"}]
["Czujki w osłonach przeciwietrznych "]
[null,"F.01U.029.411","FAD-420-HS-EN","Osłona przeciwwietrzna z podstawą ms400",{"$f":"VLOOKUP(B80,'Fire EN 54'!$D$5:$H$508,5,0)","v":{"v":1030,"d":"1030.00"}},"5A","A",null,null,{"$f":"VLOOKUP(B80,'Fire EN 54'!$D$5:$I$508,6,0)","v":"5"},"-","CN",{"$f":"VLOOKUP(B80,'Fire EN 54 FX 4,704'!$D$5:$L$500,9,0)","v":8536909599},{"$f":"VLOOKUP(B80,'Fire EN 54 FX 4,704'!$D$5:$O$500,12,0)","v":"1.944"}]
[null,"F.01U.308.231","FAD-425-O-R","Czujka optyczna do stosowania w osłonie przeciwietrznej ",{"$f":"VLOOKUP(B81,'Fire EN 54'!$D$5:$H$508,5,0)","v":{"v":515,"d":"515.00"}},"5A","A",null,null,{"$f":"VLOOKUP(B81,'Fire EN 54'!$D$5:$I$508,6,0)","v":"5"},"-","PT",{"$f":"VLOOKUP(B81,'Fire EN 54 FX 4,704'!$D$5:$L$500,9,0)","v":8531103000},{"$f":"VLOOKUP(B81,'Fire EN 54 FX 4,704'!$D$5:$O$500,12,0)","v":"0.077"}]
[null,"F.01U.029.219","D344-1.5","Rurka próbkująca o długości 45,7cm",{"$f":"VLOOKUP(B82,'Fire EN 54'!$D$5:$H$508,5,0)","v":{"v":106,"d":"106.00"}},"5A","A",null,null,{"$f":"VLOOKUP(B82,'Fire EN 54'!$D$5:$I$508,6,0)","v":"3"},"-","CN",{"$f":"VLOOKUP(B82,'Fire EN 54 FX 4,704'!$D$5:$L$500,9,0)","v":7608208990},{"$f":"VLOOKUP(B82,'Fire EN 54 FX 4,704'!$D$5:$O$500,12,0)","v":"0.058"}]
[null,"F.01U.029.175","D344-3","Rurka próbkująca 91,4 cm",{"$f":"VLOOKUP(B83,'Fire EN 54'!$D$5:$H$508,5,0)","v":{"v":206,"d":"206.00"}},"5A","A",null,null,{"$f":"VLOOKUP(B83,'Fire EN 54'!$D$5:$I$508,6,0)","v":"3"},"-","CN",{"$f":"VLOOKUP(B83,'Fire EN 54 FX 4,704'!$D$5:$L$500,9,0)","v":7608208990},{"$f":"VLOOKUP(B83,'Fire EN 54 FX 4,704'!$D$5:$O$500,12,0)","v":"0.116"}]
[null,"F.01U.029.174","D344-5","Rurka próbkująca 1,52 m(DS290)",{"$f":"VLOOKUP(B84,'Fire EN 54'!$D$5:$H$508,5,0)","v":{"v":344,"d":"344.00"}},"5A","A",null,null,{"$f":"VLOOKUP(B84,'Fire EN 54'!$D$5:$I$508,6,0)","v":"3"},"-","CN",{"$f":"VLOOKUP(B84,'Fire EN 54 FX 4,704'!$D$5:$L$500,9,0)","v":7608208990},{"$f":"VLOOKUP(B84,'Fire EN 54 FX 4,704'!$D$5:$O$500,12,0)","v":"0.21"}]
[null,"F.01U.425.789","D344-TF","Rurka filtrująca próbkująca 20/PK",{"$f":"VLOOKUP(B85,'Fire EN 54'!$D$5:$H$508,5,0)","v":{"v":636,"d":"636.00"}},"5A","A",null,null,{"$f":"VLOOKUP(B85,'Fire EN 54'!$D$5:$I$508,6,0)","v":"3"},"-","CN",{"$f":"VLOOKUP(B85,'Fire EN 54 FX 4,704'!$D$5:$L$500,9,0)","v":8421999099},{"$f":"VLOOKUP(B85,'Fire EN 54 FX 4,704'!$D$5:$O$500,12,0)","v":"0.14"}]
[null,"F.01U.029.619","FAD-RB-DIBT","Płytka przekaźników do zastosowań zgodnych z wytycznymi DIBT ",{"$f":"VLOOKUP(B86,'Fire EN 54'!$D$5:$H$508,5,0)","v":{"v":225,"d":"225.00"}},"5A","A",null,null,{"$f":"VLOOKUP(B86,'Fire EN 54'!$D$5:$I$508,6,0)","v":"3"},"-","CN",{"$f":"VLOOKUP(B86,'Fire EN 54 FX 4,704'!$D$5:$L$500,9,0)","v":85371099},{"$f":"VLOOKUP(B86,'Fire EN 54 FX 4,704'!$D$5:$O$500,12,0)","v":"0.018"}]
["AVENAR Detector 4000"]
[null,"F.01U.307.725","FAP-425-O","Czujka optyczne bez przełączników obrotowych ",{"$f":"VLOOKUP(B88,'Fire EN 54'!$D$5:$H$508,5,0)","v":{"v":297,"d":"297.00"}},"5B","A",null,null,{"$f":"VLOOKUP(B88,'Fire EN 54'!$D$5:$I$508,6,0)","v":"5"},"-","PT",{"$f":"VLOOKUP(B88,'Fire EN 54 FX 4,704'!$D$5:$L$500,9,0)","v":8531103000},{"$f":"VLOOKUP(B88,'Fire EN 54 FX 4,704'!$D$5:$O$500,12,0)","v":"0.075"}]
[null,"F.01U.307.726","FAP-425-O-R","Czujka optyczna z przełącznikami obrotowymi ",{"$f":"VLOOKUP(B89,'Fire EN 54'!$D$5:$H$508,5,0)","v":{"v":307,"d":"307.00"}},"5B","A",null,null,{"$f":"VLOOKUP(B89,'Fire EN 54'!$D$5:$I$508,6,0)","v":"5"},"-","PT",{"$f":"VLOOKUP(B89,'Fire EN 54 FX 4,704'!$D$5:$L$500,9,0)","v":8531103000},{"$f":"VLOOKUP(B89,'Fire EN 54 FX 4,704'!$D$5:$O$500,12,0)","v":"0.077"}]
[null,"F.01U.307.729","FAP-425-DO-R","Czujka optyczna Dual Ray z przełącznikami obrotowymi",{"$f":"VLOOKUP(B90,'Fire EN 54'!$D$5:$H$508,5,0)","v":{"v":332,"d":"332.00"}},"5B","A",null,null,{"$f":"VLOOKUP(B90,'Fire EN 54'!$D$5:$I$508,6,0)","v":"5"},"-","PT",{"$f":"VLOOKUP(B90,'Fire EN 54 FX 4,704'!$D$5:$L$500,9,0)","v":8531103000},{"$f":"VLOOKUP(B90,'Fire EN 54 FX 4,704'!$D$5:$O$500,12,0)","v":"0.077"}]
[null,"F.01U.307.727","FAP-425-OT","Czujka optyczno-termiczna bez przełączników obrotowych ",{"$f":"VLOOKUP(B91,'Fire EN 54'!$D$5:$H$508,5,0)","v":{"v":349,"d":"349.00"}},"5B","A",null,null,{"$f":"VLOOKUP(B91,'Fire EN 54'!$D$5:$I$508,6,0)","v":"5"},"-","PT",{"$f":"VLOOKUP(B91,'Fire EN 54 FX 4,704'!$D$5:$L$500,9,0)","v":8531103000},{"$f":"VLOOKUP(B91,'Fire EN 54 FX 4,704'!$D$5:$O$500,12,0)","v":"0.075"}]
[null,"F.01U.307.728","FAP-425-OT-R","Czujka optyczno-termiczna z przełącznikami obrotowymi",{"$f":"VLOOKUP(B92,'Fire EN 54'!$D$5:$H$508,5,0)","v":{"v":357,"d":"357.00"}},"5B","A",null,null,{"$f":"VLOOKUP(B92,'Fire EN 54'!$D$5:$I$508,6,0)","v":"5"},"-","PT",{"$f":"VLOOKUP(B92,'Fire EN 54 FX 4,704'!$D$5:$L$500,9,0)","v":8531103000},{"$f":"VLOOKUP(B92,'Fire EN 54 FX 4,704'!$D$5:$O$500,12,0)","v":"0.077"}]
[null,"F.01U.307.730","FAP-425-DOT-R","Czujka optyczno-termiczna Dual Ray z przełącznikami obrotowymi",{"$f":"VLOOKUP(B93,'Fire EN 54'!$D$5:$H$508,5,0)","v":{"v":385,"d":"385.00"}},"5B","A",null,null,{"$f":"VLOOKUP(B93,'Fire EN 54'!$D$5:$I$508,6,0)","v":"5"},"-","PT",{"$f":"VLOOKUP(B93,'Fire EN 54 FX 4,704'!$D$5:$L$500,9,0)","v":8531103000},{"$f":"VLOOKUP(B93,'Fire EN 54 FX 4,704'!$D$5:$O$500,12,0)","v":"0.077"}]
[null,"F.01U.307.732","FAH-425-T-R","Czujka termiczna z przełącznikami obrotowymi ",{"$f":"VLOOKUP(B94,'Fire EN 54'!$D$5:$H$508,5,0)","v":{"v":319,"d":"319.00"}},"5B","A",null,null,{"$f":"VLOOKUP(B94,'Fire EN 54'!$D$5:$I$508,6,0)","v":"5"},"-","PT",{"$f":"VLOOKUP(B94,'Fire EN 54 FX 4,704'!$D$5:$L$500,9,0)","v":8531103000},{"$f":"VLOOKUP(B94,'Fire EN 54 FX 4,704'!$D$5:$O$500,12,0)","v":"0.077"}]
[null,"F.01U.395.473","FAP-425-DOTCO-R","Czujka optyczno-termiczno-chemiczna z sensorem CO -  Dual Ray z przełącznikami obrotowymi ",{"$f":"VLOOKUP(B95,'Fire EN 54'!$D$5:$H$508,5,0)","v":{"v":670,"d":"670.00"}},"5A","A",null,null,{"$f":"VLOOKUP(B95,'Fire EN 54'!$D$5:$I$508,6,0)","v":"5"},"-","PT",{"$f":"VLOOKUP(B95,'Fire EN 54 FX 4,704'!$D$5:$L$500,9,0)","v":8531103000},{"$f":"VLOOKUP(B95,'Fire EN 54 FX 4,704'!$D$5:$O$500,12,0)","v":"0,082"}]
[null,"F.01U.307.731","FAP-425-DOTC-R","Czujka optyczno-termiczno-chemiczna Dual Ray z przełącznikami obrotowymi ",{"$f":"VLOOKUP(B96,'Fire EN 54'!$D$5:$H$508,5,0)","v":{"v":670,"d":"670.00"}},"5B","A",null,null,{"$f":"VLOOKUP(B96,'Fire EN 54'!$D$5:$I$508,6,0)","v":"5"},"-","PT",{"$f":"VLOOKUP(B96,'Fire EN 54 FX 4,704'!$D$5:$L$500,9,0)","v":8531103000},{"$f":"VLOOKUP(B96,'Fire EN 54 FX 4,704'!$D$5:$O$500,12,0)","v":"0.082"}]
["Akcesoria do czujek serii 425 i 520"]
["Akcesoria czujek serii 520"]
[null,"4.998.151.297","FAA-500","Gniazdo czujek serii 520",{"$f":"VLOOKUP(B99,'Fire EN 54'!$D$5:$H$508,5,0)","v":{"v":257,"d":"257.00"}},"5A","A",null,null,{"$f":"VLOOKUP(B99,'Fire EN 54'!$D$5:$I$508,6,0)","v":"5"},"-","CN",{"$f":"VLOOKUP(B99,'Fire EN 54 FX 4,704'!$D$5:$L$500,9,0)","v":8536909599},{"$f":"VLOOKUP(B99,'Fire EN 54 FX 4,704'!$D$5:$O$500,12,0)","v":"0.25"}]
[null,"4.998.151.302","FAA-500-BB","Puszka montażowa czujek serii 500 do instalacji w sufitach podwieszanych",{"$f":"VLOOKUP(B100,'Fire EN 54'!$D$5:$H$508,5,0)","v":{"v":73,"d":"73.00"}},"5A","A",null,null,{"$f":"VLOOKUP(B100,'Fire EN 54'!$D$5:$I$508,6,0)","v":"5"},"-","CN",{"$f":"VLOOKUP(B100,'Fire EN 54 FX 4,704'!$D$5:$L$500,9,0)","v":3926909790},{"$f":"VLOOKUP(B100,'Fire EN 54 FX 4,704'!$D$5:$O$500,12,0)","v":"0.166"}]
[null,"4.998.151.296","FAA-500-TR-P","Pierścień przezroczysty zewnętrzny z zestawem kolorowych wkładek",{"$f":"VLOOKUP(B101,'Fire EN 54'!$D$5:$H$508,5,0)","v":{"v":115,"d":"115.00"}},"5A","A",null,null,{"$f":"VLOOKUP(B101,'Fire EN 54'!$D$5:$I$508,6,0)","v":"5"},"-","CN",{"$f":"VLOOKUP(B101,'Fire EN 54 FX 4,704'!$D$5:$L$500,9,0)","v":3926909790},{"$f":"VLOOKUP(B101,'Fire EN 54 FX 4,704'!$D$5:$O$500,12,0)","v":"0.049"}]
[null,"4.998.151.295","FAA-500-TR-W","Pierścień biały zewnętrzny",{"$f":"VLOOKUP(B102,'Fire EN 54'!$D$5:$H$508,5,0)","v":{"v":29,"d":"29.00"}},"5A","A",null,null,{"$f":"VLOOKUP(B102,'Fire EN 54'!$D$5:$I$508,6,0)","v":"5"},"-","CN",{"$f":"VLOOKUP(B102,'Fire EN 54 FX 4,704'!$D$5:$L$500,9,0)","v":3926909790},{"$f":"VLOOKUP(B102,'Fire EN 54 FX 4,704'!$D$5:$O$500,12,0)","v":"0.03"}]
[null,"F.01U.510.166","FAA-500-SB-H","Puszka montażowa do montażu powierzchniowego z uszczelką",{"$f":"VLOOKUP(B103,'Fire EN 54'!$D$5:$H$508,5,0)","v":{"v":64,"d":"64.00"}},"5A","A",null,null,{"$f":"VLOOKUP(B103,'Fire EN 54'!$D$5:$I$508,6,0)","v":"5"},"-","CN",{"$f":"VLOOKUP(B103,'Fire EN 54 FX 4,704'!$D$5:$L$500,9,0)","v":3926909790},{"$f":"VLOOKUP(B103,'Fire EN 54 FX 4,704'!$D$5:$O$500,12,0)","v":"0.266"}]
[null,"F.01U.510.028","FAA-500-SPRING","Sprężyna do gniazd instalowanych w betonowych lub drewnianych sufitach",{"$f":"VLOOKUP(B104,'Fire EN 54'!$D$5:$H$508,5,0)","v":{"v":44,"d":"44.00"}},"5A","A","Minimalne zamówienie paczka 10 sztuk lub wielokrotność 10. Jeżeli potrzebujesz 50 sztuk zamawiasz 50.",null,{"$f":"VLOOKUP(B104,'Fire EN 54'!$D$5:$I$508,6,0)","v":"5"},"-","CN",{"$f":"VLOOKUP(B104,'Fire EN 54 FX 4,704'!$D$5:$L$500,9,0)","v":7320208990},{"$f":"VLOOKUP(B104,'Fire EN 54 FX 4,704'!$D$5:$O$500,12,0)","v":"0.116"}]
[null,"4.998.151.299","FAA-500-R","Podstawa z wyjściem przekaźnikowym ",{"$f":"VLOOKUP(B105,'Fire EN 54'!$D$5:$H$508,5,0)","v":{"v":257,"d":"257.00"}},"5A","A",null,null,{"$f":"VLOOKUP(B105,'Fire EN 54'!$D$5:$I$508,6,0)","v":"5"},"-","CN",{"$f":"VLOOKUP(B105,'Fire EN 54 FX 4,704'!$D$5:$L$500,9,0)","v":8536909599},{"$f":"VLOOKUP(B105,'Fire EN 54 FX 4,704'!$D$5:$O$500,12,0)","v":"0.24"}]
[null,"F.01U.508.713","FAA-500-CB","Zintegrowana obudowa do sufitów betonowych ",{"$f":"VLOOKUP(B106,'Fire EN 54'!$D$5:$H$508,5,0)","v":{"v":347,"d":"347.00"}},"5A","B",null,null,{"$f":"VLOOKUP(B106,'Fire EN 54'!$D$5:$I$508,6,0)","v":"5"},"-","DE",{"$f":"VLOOKUP(B106,'Fire EN 54 FX 4,704'!$D$5:$L$500,9,0)","v":3926909790},{"$f":"VLOOKUP(B106,'Fire EN 54 FX 4,704'!$D$5:$O$500,12,0)","v":"0.2"}]
["Akcesoria do czujek serii 420 i 425"]
[null,"4.998.021.535","MS 400","Gniazdo czujek serii 400",{"$f":"VLOOKUP(B108,'Fire EN 54'!$D$5:$H$508,5,0)","v":{"v":33,"d":"33.00"}},"5A",1,null,null,{"$f":"VLOOKUP(B108,'Fire EN 54'!$D$5:$I$508,6,0)","v":"5"},"-","CN",{"$f":"VLOOKUP(B108,'Fire EN 54 FX 4,704'!$D$5:$L$500,9,0)","v":8536909599},{"$f":"VLOOKUP(B108,'Fire EN 54 FX 4,704'!$D$5:$O$500,12,0)","v":"0.009"}]
[null,"F.01U.215.139","MS 400 B","Gniazdo czujek serii 400 z logo Bosch",{"$f":"VLOOKUP(B109,'Fire EN 54'!$D$5:$H$508,5,0)","v":{"v":34,"d":"34.00"}},"5A","A",null,null,{"$f":"VLOOKUP(B109,'Fire EN 54'!$D$5:$I$508,6,0)","v":"5"},"-","CN",{"$f":"VLOOKUP(B109,'Fire EN 54 FX 4,704'!$D$5:$L$500,9,0)","v":8536909599},{"$f":"VLOOKUP(B109,'Fire EN 54 FX 4,704'!$D$5:$O$500,12,0)","v":"0.09"}]
[null,"F.01U.215.142","FAA-420-SEAL","Gumowa uszczelka do pomieszczeń wilgotnych dla podstaw MS400 ",{"$f":"VLOOKUP(B110,'Fire EN 54'!$D$5:$H$508,5,0)","v":{"v":588,"d":"588.00"}},"5A","A","Minimalne zamówienie paczka 10 sztuk lub wielokrotność 10. Jeżeli potrzebujesz 50 sztuk zamawiasz 5",null,{"$f":"VLOOKUP(B110,'Fire EN 54'!$D$5:$I$508,6,0)","v":"5"},"-","CN",{"$f":"VLOOKUP(B110,'Fire EN 54 FX 4,704'!$D$5:$L$500,9,0)","v":8536909599},{"$f":"VLOOKUP(B110,'Fire EN 54 FX 4,704'!$D$5:$O$500,12,0)","v":"0.23"}]
[null,"F.01U.508.658","FAA-MSR420 ","Gniazdo czujki z wyjściem przekaźnikowym (tylko do czujek serii 420!!)",{"$f":"VLOOKUP(B111,'Fire EN 54'!$D$5:$H$508,5,0)","v":{"v":204,"d":"204.00"}},"5A","A",null,null,{"$f":"VLOOKUP(B111,'Fire EN 54'!$D$5:$I$508,6,0)","v":"5"},"-","CN",{"$f":"VLOOKUP(B111,'Fire EN 54 FX 4,704'!$D$5:$L$500,9,0)","v":8536909599},{"$f":"VLOOKUP(B111,'Fire EN 54 FX 4,704'!$D$5:$O$500,12,0)","v":"0.09"}]
[null,"4.998.113.025","MSC 420","MSC 420 podstawa do montażu sufitowego ",{"$f":"VLOOKUP(B112,'Fire EN 54'!$D$5:$H$508,5,0)","v":{"v":33,"d":"33.00"}},"5A","A",null,null,{"$f":"VLOOKUP(B112,'Fire EN 54'!$D$5:$I$508,6,0)","v":"5"},"-","CN",{"$f":"VLOOKUP(B112,'Fire EN 54 FX 4,704'!$D$5:$L$500,9,0)","v":3926909790},{"$f":"VLOOKUP(B112,'Fire EN 54 FX 4,704'!$D$5:$O$500,12,0)","v":"0.1"}]
[null,"4.998.114.565","MSR 320","MSC 320 podstawa z przekaźnikiem ",{"$f":"VLOOKUP(B113,'Fire EN 54'!$D$5:$H$508,5,0)","v":{"v":145,"d":"145.00"}},"5A",1,null,null,{"$f":"VLOOKUP(B113,'Fire EN 54'!$D$5:$I$508,6,0)","v":"5"},"-","CN",{"$f":"VLOOKUP(B113,'Fire EN 54 FX 4,704'!$D$5:$L$500,9,0)","v":8536909599},{"$f":"VLOOKUP(B113,'Fire EN 54 FX 4,704'!$D$5:$O$500,12,0)","v":"0.04"}]
[null,"4.998.025.369","SK 400","Metalowa kratka zabezpieczająca",{"$f":"VLOOKUP(B114,'Fire EN 54'!$D$5:$H$508,5,0)","v":{"v":232,"d":"232.00"}},"5A","A",null,null,{"$f":"VLOOKUP(B114,'Fire EN 54'!$D$5:$I$508,6,0)","v":"5"},"-","DE",{"$f":"VLOOKUP(B114,'Fire EN 54 FX 4,704'!$D$5:$L$500,9,0)","v":7326909890},{"$f":"VLOOKUP(B114,'Fire EN 54 FX 4,704'!$D$5:$O$500,12,0)","v":"0.3"}]
[null,"4.998.035.312","SSK400","Osłona zabezpieczająca przed kurzem - cena za 10 sztuk. ",{"$f":"VLOOKUP(B115,'Fire EN 54'!$D$5:$H$508,5,0)","v":{"v":125,"d":"125.00"}},"5A","A","Minimalna wielkość zamówienia 10 sztuk lub wielokrotność 10. Jeżeli potrzebujesz 30 sztuk zamawiasz 3.",null,{"$f":"VLOOKUP(B115,'Fire EN 54'!$D$5:$I$508,6,0)","v":"5"},"-","DE",{"$f":"VLOOKUP(B115,'Fire EN 54 FX 4,704'!$D$5:$L$500,9,0)","v":3926909790},{"$f":"VLOOKUP(B115,'Fire EN 54 FX 4,704'!$D$5:$O$500,12,0)","v":"0.21"}]
[null,"4.998.084.709","TP4 400","Tabliczka znamionowa do nanoszenia numerów stref  i czujek (do montażu na wysokości do 4 m),- cena za 1 sztukę. ",{"$f":"VLOOKUP(B116,'Fire EN 54'!$D$5:$H$508,5,0)","v":{"v":3,"d":"3.00"}},"5A","A","Minimalna ilość zamówienia 50sztuk lub wielokrotność 50. Potrzebujesz 150 sztuk zamawiasz 150 ",null,{"$f":"VLOOKUP(B116,'Fire EN 54'!$D$5:$I$508,6,0)","v":"5"},"-","DE",{"$f":"VLOOKUP(B116,'Fire EN 54 FX 4,704'!$D$5:$L$500,9,0)","v":3926909790},{"$f":"VLOOKUP(B116,'Fire EN 54 FX 4,704'!$D$5:$O$500,12,0)","v":"0.006"}]
[null,"4.998.084.710","TP8 400","Tabliczka znamionowa do nanoszenia numerów stref  i czujek (do montażu na wysokości do 8 m)- cena za 1 sztukę . ",{"$f":"VLOOKUP(B117,'Fire EN 54'!$D$5:$H$508,5,0)","v":{"v":3,"d":"3.00"}},"5A","A","Minimalna ilość zamówienia 50 sztuk lub wielokrotność 50. Potrzebujesz 150 sztuk zamawiasz 150  ",null,{"$f":"VLOOKUP(B117,'Fire EN 54'!$D$5:$I$508,6,0)","v":"5"},"-","DE",{"$f":"VLOOKUP(B117,'Fire EN 54 FX 4,704'!$D$5:$L$500,9,0)","v":3926909790},{"$f":"VLOOKUP(B117,'Fire EN 54 FX 4,704'!$D$5:$O$500,12,0)","v":"0.009"}]
[null,"4.998.025.373","MH 400","Grzałka czujki",{"$f":"VLOOKUP(B118,'Fire EN 54'!$D$5:$H$508,5,0)","v":{"v":233,"d":"233.00"}},"5A","A",null,null,{"$f":"VLOOKUP(B118,'Fire EN 54'!$D$5:$I$508,6,0)","v":"5"},"-","DE",{"$f":"VLOOKUP(B118,'Fire EN 54 FX 4,704'!$D$5:$L$500,9,0)","v":{"$error":"#N/A"}},{"$f":"VLOOKUP(B118,'Fire EN 54 FX 4,704'!$D$5:$O$500,12,0)","v":{"$error":"#N/A"}}]
[null,"4.998.097.924","WA400","MK 400, uchwyt do instalacji czujki ",{"$f":"VLOOKUP(B119,'Fire EN 54'!$D$5:$H$508,5,0)","v":{"v":207,"d":"207.00"}},"5A","A",null,null,{"$f":"VLOOKUP(B119,'Fire EN 54'!$D$5:$I$508,6,0)","v":"5"},"-","DE",{"$f":"VLOOKUP(B119,'Fire EN 54 FX 4,704'!$D$5:$L$500,9,0)","v":3926909790},{"$f":"VLOOKUP(B119,'Fire EN 54 FX 4,704'!$D$5:$O$500,12,0)","v":"0.199"}]
[null,"2.799.271.257","FMX-DET-MB","Uchwyt montażowy do instalacji pod podłogą uniesioną. Nie zawiera gniazda czujki.",{"$f":"VLOOKUP(B120,'Fire EN 54'!$D$5:$H$508,5,0)","v":{"v":119,"d":"119.00"}},"5A","A",null,null,{"$f":"VLOOKUP(B120,'Fire EN 54'!$D$5:$I$508,6,0)","v":"5"},"-","DE",{"$f":"VLOOKUP(B120,'Fire EN 54 FX 4,704'!$D$5:$L$500,9,0)","v":3926909790},{"$f":"VLOOKUP(B120,'Fire EN 54 FX 4,704'!$D$5:$O$500,12,0)","v":"0.09"}]
[null,"F.01U.289.620","FAA-420-RI-DIN","Wskaźnik zadziałania",{"$f":"VLOOKUP(B121,'Fire EN 54'!$D$5:$H$508,5,0)","v":{"v":225,"d":"225.00"}},"5A","A",null,null,{"$f":"VLOOKUP(B121,'Fire EN 54'!$D$5:$I$508,6,0)","v":"5"},"-","PT",{"$f":"VLOOKUP(B121,'Fire EN 54 FX 4,704'!$D$5:$L$500,9,0)","v":8531900000},{"$f":"VLOOKUP(B121,'Fire EN 54 FX 4,704'!$D$5:$O$500,12,0)","v":"0.061"}]
[null,"F.01U.289.120","FAA-420-RI-ROW","Wskaźnik zadziałania",{"$f":"VLOOKUP(B122,'Fire EN 54'!$D$5:$H$508,5,0)","v":{"v":75,"d":"75.00"}},"5A","A",null,null,{"$f":"VLOOKUP(B122,'Fire EN 54'!$D$5:$I$508,6,0)","v":"5"},"-","PT",{"$f":"VLOOKUP(B122,'Fire EN 54 FX 4,704'!$D$5:$L$500,9,0)","v":8531900000},{"$f":"VLOOKUP(B122,'Fire EN 54 FX 4,704'!$D$5:$O$500,12,0)","v":"0.058"}]
["Czujki specjalne"]
["Liniowe czujki dymu"]
[null,"F.01U.400.533","FRAY-ONE-EN","Czujka liniowa Fireray ONE",{"$f":"VLOOKUP(B125,'Fire EN 54'!$D$5:$H$508,5,0)","v":{"v":7078,"d":"7078.00"}},"5A","A",null,null,{"$f":"VLOOKUP(B125,'Fire EN 54'!$D$5:$I$508,6,0)","v":"3"},"-","GB",{"$f":"VLOOKUP(B125,'Fire EN 54 FX 4,704'!$D$5:$L$500,9,0)","v":"85365019"},{"$f":"VLOOKUP(B125,'Fire EN 54 FX 4,704'!$D$5:$O$500,12,0)","v":"0.800"}]
[null,"F.01U.290.195","FIRERAY3000","Fireray 3000 Liniowa czujka dymu ",{"$f":"VLOOKUP(B126,'Fire EN 54'!$D$5:$H$508,5,0)","v":{"v":14641,"d":"14641.00"}},"5A","A",null,null,{"$f":"VLOOKUP(B126,'Fire EN 54'!$D$5:$I$508,6,0)","v":"3"},"-","GB",{"$f":"VLOOKUP(B126,'Fire EN 54 FX 4,704'!$D$5:$L$500,9,0)","v":8536501999},{"$f":"VLOOKUP(B126,'Fire EN 54 FX 4,704'!$D$5:$O$500,12,0)","v":"1.62"}]
[null,"F.01U.290.196","FIRERAY3000-HD","Fireray 3000 dodatkowa glowica ",{"$f":"VLOOKUP(B127,'Fire EN 54'!$D$5:$H$508,5,0)","v":{"v":12649,"d":"12649.00"}},"5A","A",null,null,{"$f":"VLOOKUP(B127,'Fire EN 54'!$D$5:$I$508,6,0)","v":"3"},"-","GB",{"$f":"VLOOKUP(B127,'Fire EN 54 FX 4,704'!$D$5:$L$500,9,0)","v":8536501999},{"$f":"VLOOKUP(B127,'Fire EN 54 FX 4,704'!$D$5:$O$500,12,0)","v":"0.65"}]
[null,"F.01U.290.197","FIRERAY5000-EN","Czujka liniowa FireRay5000 (możliwość pracy dwóch głowic)",{"$f":"VLOOKUP(B128,'Fire EN 54'!$D$5:$H$508,5,0)","v":{"v":11760,"d":"11760.00"}},"5A","A",null,null,{"$f":"VLOOKUP(B128,'Fire EN 54'!$D$5:$I$508,6,0)","v":"3"},"-","GB",{"$f":"VLOOKUP(B128,'Fire EN 54 FX 4,704'!$D$5:$L$500,9,0)","v":8536501999},{"$f":"VLOOKUP(B128,'Fire EN 54 FX 4,704'!$D$5:$O$500,12,0)","v":"2.106"}]
[null,"F.01U.143.247","FRAY5000-HEAD-EN","Dodatkowa głowica do FRAY5000-EN z jednym lustrem ",{"$f":"VLOOKUP(B129,'Fire EN 54'!$D$5:$H$508,5,0)","v":{"v":6813,"d":"6813.00"}},"5A","A",null,null,{"$f":"VLOOKUP(B129,'Fire EN 54'!$D$5:$I$508,6,0)","v":"3"},"-","GB",{"$f":"VLOOKUP(B129,'Fire EN 54 FX 4,704'!$D$5:$L$500,9,0)","v":8531900000},{"$f":"VLOOKUP(B129,'Fire EN 54 FX 4,704'!$D$5:$O$500,12,0)","v":"0.666"}]
[null,"F.01U.083.264","FRAY5000-LR-KIT","Fireray5000 zestaw dłuższego zasięgu , przedłużenie 50m zawiera 3 lustra ",{"$f":"VLOOKUP(B130,'Fire EN 54'!$D$5:$H$508,5,0)","v":{"v":1904,"d":"1904.00"}},"5A","A",null,null,{"$f":"VLOOKUP(B130,'Fire EN 54'!$D$5:$I$508,6,0)","v":"3"},"-","GB",{"$f":"VLOOKUP(B130,'Fire EN 54 FX 4,704'!$D$5:$L$500,9,0)","v":8536501999},{"$f":"VLOOKUP(B130,'Fire EN 54 FX 4,704'!$D$5:$O$500,12,0)","v":"0.18"}]
[null,"F.01U.098.240","FRAY5000-BR","Uniwersalny wspornik dla Fireray5000",{"$f":"VLOOKUP(B131,'Fire EN 54'!$D$5:$H$508,5,0)","v":{"v":1909,"d":"1909.00"}},"5A","A",null,null,{"$f":"VLOOKUP(B131,'Fire EN 54'!$D$5:$I$508,6,0)","v":"3"},"-","US",{"$f":"VLOOKUP(B131,'Fire EN 54 FX 4,704'!$D$5:$L$500,9,0)","v":7326909890},{"$f":"VLOOKUP(B131,'Fire EN 54 FX 4,704'!$D$5:$O$500,12,0)","v":"0.199"}]
[null,"F.01U.098.241","FRAY5000-4PRISM","Element umożliwiający instalację  4 luster",{"$f":"VLOOKUP(B132,'Fire EN 54'!$D$5:$H$508,5,0)","v":{"v":1208,"d":"1208.00"}},"5A","A",null,null,{"$f":"VLOOKUP(B132,'Fire EN 54'!$D$5:$I$508,6,0)","v":"3"},"-","US",{"$f":"VLOOKUP(B132,'Fire EN 54 FX 4,704'!$D$5:$L$500,9,0)","v":7326909890},{"$f":"VLOOKUP(B132,'Fire EN 54 FX 4,704'!$D$5:$O$500,12,0)","v":"0.383"}]
[null,"F.01U.098.242","FRAY5000-1PRISM","Element umożliwiający instalacje jednego lustra",{"$f":"VLOOKUP(B133,'Fire EN 54'!$D$5:$H$508,5,0)","v":{"v":1057,"d":"1057.00"}},"5A","A",null,null,{"$f":"VLOOKUP(B133,'Fire EN 54'!$D$5:$I$508,6,0)","v":"3"},"-","US",{"$f":"VLOOKUP(B133,'Fire EN 54 FX 4,704'!$D$5:$L$500,9,0)","v":7326909890},{"$f":"VLOOKUP(B133,'Fire EN 54 FX 4,704'!$D$5:$O$500,12,0)","v":"0.09"}]
["Liniowe czujki termiczne"]
[null,"F.01U.393.476","FCS-LHD-2EN ","Liniowa czujka termiczna, VdS",{"$f":"VLOOKUP(B135,'Fire EN 54'!$D$5:$H$508,5,0)","v":{"v":15550,"d":"15550.00"}},"5A","A",null,null,{"$f":"VLOOKUP(B135,'Fire EN 54'!$D$5:$I$508,6,0)","v":"3"},"-","GB",{"$f":"VLOOKUP(B135,'Fire EN 54 FX 4,704'!$D$5:$L$500,9,0)","v":8536501990},{"$f":"VLOOKUP(B135,'Fire EN 54 FX 4,704'!$D$5:$O$500,12,0)","v":"0.950"}]
[null,"F.01U.395.474","FCS-LHDSC-EN100","Kabel sensoryczny PVC, VdS, 100m",{"$f":"VLOOKUP(B136,'Fire EN 54'!$D$5:$H$508,5,0)","v":{"v":7372,"d":"7372.00"}},"5A","A","Kabel sensoryczny na szpuli 100m",null,{"$f":"VLOOKUP(B136,'Fire EN 54'!$D$5:$I$508,6,0)","v":"3"},"-","GB",{"$f":"VLOOKUP(B136,'Fire EN 54 FX 4,704'!$D$5:$L$500,9,0)","v":85444993},{"$f":"VLOOKUP(B136,'Fire EN 54 FX 4,704'!$D$5:$O$500,12,0)","v":"2.470"}]
[null,"F.01U.395.475","FCS-LHDSC-EN250","Kabel sensoryczny PVC, VdS, 250m",{"$f":"VLOOKUP(B137,'Fire EN 54'!$D$5:$H$508,5,0)","v":{"v":18442,"d":"18442.00"}},"5A","A","Kabel sensoryczny na szpuli 250m",null,{"$f":"VLOOKUP(B137,'Fire EN 54'!$D$5:$I$508,6,0)","v":"3"},"-","GB",{"$f":"VLOOKUP(B137,'Fire EN 54 FX 4,704'!$D$5:$L$500,9,0)","v":85444993},{"$f":"VLOOKUP(B137,'Fire EN 54 FX 4,704'!$D$5:$O$500,12,0)","v":"6.180"}]
[null,"F.01U.395.476","FCS-LHDSC-EN500","Kabel sensoryczny PVC, VdS, 500m",{"$f":"VLOOKUP(B138,'Fire EN 54'!$D$5:$H$508,5,0)","v":{"v":36741,"d":"36741.00"}},"5A","A","Kabel sensoryczny na szpuli 500m",null,{"$f":"VLOOKUP(B138,'Fire EN 54'!$D$5:$I$508,6,0)","v":"3"},"-","GB",{"$f":"VLOOKUP(B138,'Fire EN 54 FX 4,704'!$D$5:$L$500,9,0)","v":85444993},{"$f":"VLOOKUP(B138,'Fire EN 54 FX 4,704'!$D$5:$O$500,12,0)","v":"12.350"}]
[null,"F.01U.403.515","FCS-LHDSC-NYL100","Kabel sensoryczny nylon, VdS, 100m",{"$f":"VLOOKUP(B139,'Fire EN 54'!$D$5:$H$508,5,0)","v":{"v":9273,"d":"9273.00"}},"5A","A","Kabel sensoryczny na szpuli 100m",null,{"$f":"VLOOKUP(B139,'Fire EN 54'!$D$5:$I$508,6,0)","v":"3"},"-","GB",{"$f":"VLOOKUP(B139,'Fire EN 54 FX 4,704'!$D$5:$L$500,9,0)","v":85444993},{"$f":"VLOOKUP(B139,'Fire EN 54 FX 4,704'!$D$5:$O$500,12,0)","v":"3.510"}]
[null,"F.01U.403.516","FCS-LHDSC-NYL250","Kabel sensoryczny nylon, VdS, 250m",{"$f":"VLOOKUP(B140,'Fire EN 54'!$D$5:$H$508,5,0)","v":{"v":22890,"d":"22890.00"}},"5A","A","Kabel sensoryczny na szpuli 250m",null,{"$f":"VLOOKUP(B140,'Fire EN 54'!$D$5:$I$508,6,0)","v":"3"},"-","GB",{"$f":"VLOOKUP(B140,'Fire EN 54 FX 4,704'!$D$5:$L$500,9,0)","v":85444993},{"$f":"VLOOKUP(B140,'Fire EN 54 FX 4,704'!$D$5:$O$500,12,0)","v":"8.780"}]
[null,"F.01U.403.517","FCS-LHDSC-NYL500","Kabel sensoryczny nylon, VdS, 500m",{"$f":"VLOOKUP(B141,'Fire EN 54'!$D$5:$H$508,5,0)","v":{"v":44606,"d":"44606.00"}},"5A","A","Kabel sensoryczny na szpuli 500m",null,{"$f":"VLOOKUP(B141,'Fire EN 54'!$D$5:$I$508,6,0)","v":"3"},"-","GB",{"$f":"VLOOKUP(B141,'Fire EN 54 FX 4,704'!$D$5:$L$500,9,0)","v":85444993},{"$f":"VLOOKUP(B141,'Fire EN 54 FX 4,704'!$D$5:$O$500,12,0)","v":"17.550"}]
[null,"F.01U.403.518","FCS-LHDSC-STL100","Kabel sensoryczny stal, VdS, 100m",{"$f":"VLOOKUP(B142,'Fire EN 54'!$D$5:$H$508,5,0)","v":{"v":14849,"d":"14849.00"}},"5A","A","Kabel sensoryczny na szpuli 100m",null,{"$f":"VLOOKUP(B142,'Fire EN 54'!$D$5:$I$508,6,0)","v":"3"},"-","GB",{"$f":"VLOOKUP(B142,'Fire EN 54 FX 4,704'!$D$5:$L$500,9,0)","v":85444993},{"$f":"VLOOKUP(B142,'Fire EN 54 FX 4,704'!$D$5:$O$500,12,0)","v":"3.770"}]
[null,"F.01U.403.519","FCS-LHDSC-STL250","Kabel sensoryczny stal, VdS, 250m",{"$f":"VLOOKUP(B143,'Fire EN 54'!$D$5:$H$508,5,0)","v":{"v":36316,"d":"36316.00"}},"5A","A","Kabel sensoryczny na szpuli 250m",null,{"$f":"VLOOKUP(B143,'Fire EN 54'!$D$5:$I$508,6,0)","v":"3"},"-","GB",{"$f":"VLOOKUP(B143,'Fire EN 54 FX 4,704'!$D$5:$L$500,9,0)","v":85444993},{"$f":"VLOOKUP(B143,'Fire EN 54 FX 4,704'!$D$5:$O$500,12,0)","v":"9.430"}]
[null,"F.01U.403.520","FCS-LHDSC-STL500","Kabel sensoryczny stal, VdS, 500m",{"$f":"VLOOKUP(B144,'Fire EN 54'!$D$5:$H$508,5,0)","v":{"v":71018,"d":"71018.00"}},"5A","A","Kabel sensoryczny na szpuli 500m",null,{"$f":"VLOOKUP(B144,'Fire EN 54'!$D$5:$I$508,6,0)","v":"3"},"-","GB",{"$f":"VLOOKUP(B144,'Fire EN 54 FX 4,704'!$D$5:$L$500,9,0)","v":85444993},{"$f":"VLOOKUP(B144,'Fire EN 54 FX 4,704'!$D$5:$O$500,12,0)","v":"18.850"}]
[null,"F.01U.395.477","FCS-LHD2EN-EOL","Moduł End-of-line, VdS",{"$f":"VLOOKUP(B145,'Fire EN 54'!$D$5:$H$508,5,0)","v":{"v":1963,"d":"1963.00"}},"5A","A",null,"Wymagane do zakończenia linii\nprzewodu czujnika",{"$f":"VLOOKUP(B145,'Fire EN 54'!$D$5:$I$508,6,0)","v":"3"},"-","GB",{"$f":"VLOOKUP(B145,'Fire EN 54 FX 4,704'!$D$5:$L$500,9,0)","v":85319000},{"$f":"VLOOKUP(B145,'Fire EN 54 FX 4,704'!$D$5:$O$500,12,0)","v":"0.112"}]
[null,"F.01U.395.478","FCS-LHD2EN-CONN","Puszka łączeniowa, VdS",{"$f":"VLOOKUP(B146,'Fire EN 54'!$D$5:$H$508,5,0)","v":{"v":1510,"d":"1510.00"}},"5A","A",null,"Skrzynka przyłączowa do podłączenia dwóch przewodów\nczujnika",{"$f":"VLOOKUP(B146,'Fire EN 54'!$D$5:$I$508,6,0)","v":"3"},"-","GB",{"$f":"VLOOKUP(B146,'Fire EN 54 FX 4,704'!$D$5:$L$500,9,0)","v":85319000},{"$f":"VLOOKUP(B146,'Fire EN 54 FX 4,704'!$D$5:$O$500,12,0)","v":"0.211"}]
[null,"F.01U.395.480","FCS-LHD2EN-CLIP","Zacisk L-Clip, 50mm",{"$f":"VLOOKUP(B147,'Fire EN 54'!$D$5:$H$508,5,0)","v":{"v":1440,"d":"1440.00"}},"5A","A","Opakowanie 100 sztuk. Chcąc zamówić 200 klipsów, zamawiamy 2 pozycje","Zacisk L-Clip Zintec do montażu kabla detektora",{"$f":"VLOOKUP(B147,'Fire EN 54'!$D$5:$I$508,6,0)","v":"3"},"-","GB",{"$f":"VLOOKUP(B147,'Fire EN 54 FX 4,704'!$D$5:$L$500,9,0)","v":73261990},{"$f":"VLOOKUP(B147,'Fire EN 54 FX 4,704'!$D$5:$O$500,12,0)","v":"0.040"}]
[null,"F.01U.395.479","FCS-LHD2EN-SLE","Tuleje silikonowe",{"$f":"VLOOKUP(B148,'Fire EN 54'!$D$5:$H$508,5,0)","v":{"v":377,"d":"377.00"}},"5A","A","Opakowanie 100 sztuk. Chcąc zamówić 200 sztuk, zamawiamy 2 pozycje","Wymagana do montażu kabla detektora\ndo zacisku L-Clip.",{"$f":"VLOOKUP(B148,'Fire EN 54'!$D$5:$I$508,6,0)","v":"3"},"-","GB",{"$f":"VLOOKUP(B148,'Fire EN 54 FX 4,704'!$D$5:$L$500,9,0)","v":39259010},{"$f":"VLOOKUP(B148,'Fire EN 54 FX 4,704'!$D$5:$O$500,12,0)","v":"1.590"}]
["Czujka płomienia"]
[null,"F.01U.418.818","922819","Czujka płomieniar FMX5000 IR VK",{"$f":"VLOOKUP(B150,'Fire EN 54'!$D$5:$H$508,5,0)","v":{"v":29823,"d":"29823.00"}},"5A","C","Konieczne zamówienie również:  929144, 924441. Opcjonalnie: 904757.","Wersja bez Ex",{"$f":"VLOOKUP(B150,'Fire EN 54'!$D$5:$I$508,6,0)","v":"3"},"-","DE",{"$f":"VLOOKUP(B150,'Fire EN 54 FX 4,704'!$D$5:$L$500,9,0)","v":85365019},{"$f":"VLOOKUP(B150,'Fire EN 54 FX 4,704'!$D$5:$O$500,12,0)","v":"0.590"}]
[null,"F.01U.418.821",929144,"Moduł przekaźnika KMX5000 RK VK",{"$f":"VLOOKUP(B151,'Fire EN 54'!$D$5:$H$508,5,0)","v":{"v":2278,"d":"2278.00"}},"5A","C",null,null,{"$f":"VLOOKUP(B151,'Fire EN 54'!$D$5:$I$508,6,0)","v":"3"},"-","DE",{"$f":"VLOOKUP(B151,'Fire EN 54 FX 4,704'!$D$5:$L$500,9,0)","v":85319000},{"$f":"VLOOKUP(B151,'Fire EN 54 FX 4,704'!$D$5:$O$500,12,0)","v":"0.050"}]
[null,"F.01U.418.824",924441,"Gniazdo czujki MX5000 VK",{"$f":"VLOOKUP(B152,'Fire EN 54'!$D$5:$H$508,5,0)","v":{"v":1542,"d":"1542.00"}},"5A","C",null,null,{"$f":"VLOOKUP(B152,'Fire EN 54'!$D$5:$I$508,6,0)","v":"3"},"-","DE",{"$f":"VLOOKUP(B152,'Fire EN 54 FX 4,704'!$D$5:$L$500,9,0)","v":85389099},{"$f":"VLOOKUP(B152,'Fire EN 54 FX 4,704'!$D$5:$O$500,12,0)","v":"0.380"}]
[null,"F.01U.418.826",904757,"Uchwyt montażowy MX5000",{"$f":"VLOOKUP(B153,'Fire EN 54'!$D$5:$H$508,5,0)","v":{"v":242,"d":"242.00"}},"5A","C",null,null,{"$f":"VLOOKUP(B153,'Fire EN 54'!$D$5:$I$508,6,0)","v":"3"},"-","DE",{"$f":"VLOOKUP(B153,'Fire EN 54 FX 4,704'!$D$5:$L$500,9,0)","v":85389099},{"$f":"VLOOKUP(B153,'Fire EN 54 FX 4,704'!$D$5:$O$500,12,0)","v":"0.095"}]
[null,"F.01U.418.819",924420,"IR-flame detector FMX5000 IR 3GD",{"$f":"VLOOKUP(B154,'Fire EN 54'!$D$5:$H$508,5,0)","v":{"v":36960,"d":"36960.00"}},"5A","C","Konieczna zamówienie również: 926826 oraz 924442. Opcjonalnie 904757","Wersja Ex",{"$f":"VLOOKUP(B154,'Fire EN 54'!$D$5:$I$508,6,0)","v":"3"},"-","DE",{"$f":"VLOOKUP(B154,'Fire EN 54 FX 4,704'!$D$5:$L$500,9,0)","v":"90318080"},{"$f":"VLOOKUP(B154,'Fire EN 54 FX 4,704'!$D$5:$O$500,12,0)","v":"0.590"}]
[null,"F.01U.418.822",926826,"Relay module KMX5000 RK 3GD VK",{"$f":"VLOOKUP(B155,'Fire EN 54'!$D$5:$H$508,5,0)","v":{"v":3059,"d":"3059.00"}},"5A","C",null,null,{"$f":"VLOOKUP(B155,'Fire EN 54'!$D$5:$I$508,6,0)","v":"3"},"-","DE",{"$f":"VLOOKUP(B155,'Fire EN 54 FX 4,704'!$D$5:$L$500,9,0)","v":"85319085"},{"$f":"VLOOKUP(B155,'Fire EN 54 FX 4,704'!$D$5:$O$500,12,0)","v":"0.050"}]
[null,"F.01U.418.820",911674,"IR-flame detector FMX5000 IR Ex",{"$f":"VLOOKUP(B156,'Fire EN 54'!$D$5:$H$508,5,0)","v":{"v":43333,"d":"43333.00"}},"5A","C","Konieczna zamówienie również: 922689 oraz 924442. Opcjonalnie 904757","Wersja Ex",{"$f":"VLOOKUP(B156,'Fire EN 54'!$D$5:$I$508,6,0)","v":"3"},"-","DE",{"$f":"VLOOKUP(B156,'Fire EN 54 FX 4,704'!$D$5:$L$500,9,0)","v":"90318080"},{"$f":"VLOOKUP(B156,'Fire EN 54 FX 4,704'!$D$5:$O$500,12,0)","v":"0.590"}]
[null,"F.01U.418.823",922689,"Bariera Ex. 24V 2 channel",{"$f":"VLOOKUP(B157,'Fire EN 54'!$D$5:$H$508,5,0)","v":{"v":9559,"d":"9559.00"}},"5A","C",null,null,{"$f":"VLOOKUP(B157,'Fire EN 54'!$D$5:$I$508,6,0)","v":"3"},"-","DE",{"$f":"VLOOKUP(B157,'Fire EN 54 FX 4,704'!$D$5:$L$500,9,0)","v":"85363010"},{"$f":"VLOOKUP(B157,'Fire EN 54 FX 4,704'!$D$5:$O$500,12,0)","v":"0.150"}]
[null,"F.01U.418.825",924442,"Gniazdo czujki MX5000 Ex VK",{"$f":"VLOOKUP(B158,'Fire EN 54'!$D$5:$H$508,5,0)","v":{"v":2804,"d":"2804.00"}},"5A","C",null,null,{"$f":"VLOOKUP(B158,'Fire EN 54'!$D$5:$I$508,6,0)","v":"3"},"-","DE",{"$f":"VLOOKUP(B158,'Fire EN 54 FX 4,704'!$D$5:$L$500,9,0)","v":"85389099"},{"$f":"VLOOKUP(B158,'Fire EN 54 FX 4,704'!$D$5:$O$500,12,0)","v":"0.530"}]
[null,"F.01U.279.762","016589","IR3 Flame Detector",{"$f":"VLOOKUP(B159,'Fire EN 54'!$D$5:$H$508,5,0)","v":{"v":33137,"d":"33137.00"}},"5A","A",null,null,{"$f":"VLOOKUP(B159,'Fire EN 54'!$D$5:$I$508,6,0)","v":"3"},"-","GB",{"$f":"VLOOKUP(B159,'Fire EN 54 FX 4,704'!$D$5:$L$500,9,0)","v":8536501999},{"$f":"VLOOKUP(B159,'Fire EN 54 FX 4,704'!$D$5:$O$500,12,0)","v":"2.0"}]
[null,"F.01U.279.880","007127","Mounting Bracket Flame Detector",{"$f":"VLOOKUP(B160,'Fire EN 54'!$D$5:$H$508,5,0)","v":{"v":1963,"d":"1963.00"}},"5A","A",null,null,{"$f":"VLOOKUP(B160,'Fire EN 54'!$D$5:$I$508,6,0)","v":"3"},"-","GB",{"$f":"VLOOKUP(B160,'Fire EN 54 FX 4,704'!$D$5:$L$500,9,0)","v":8536501999},{"$f":"VLOOKUP(B160,'Fire EN 54 FX 4,704'!$D$5:$O$500,12,0)","v":"0.655"}]
[null,"F.01U.279.764","016519","IR3 – czujka płomienia w wersji EX",{"$f":"VLOOKUP(B161,'Fire EN 54'!$D$5:$H$508,5,0)","v":{"v":41340,"d":"41340.00"}},"5A","A",null,null,{"$f":"VLOOKUP(B161,'Fire EN 54'!$D$5:$I$508,6,0)","v":"3"},"-","GB",{"$f":"VLOOKUP(B161,'Fire EN 54 FX 4,704'!$D$5:$L$500,9,0)","v":8531103000},{"$f":"VLOOKUP(B161,'Fire EN 54 FX 4,704'!$D$5:$O$500,12,0)","v":"2.5"}]
["Czujki punktowe EX (iskrobezpieczne)"]
[null,"F.01U.332.582","OOH740-A9-EX","Dualna czujka optyczna w wersji EX",{"$f":"VLOOKUP(B163,'Fire EN 54'!$D$5:$H$508,5,0)","v":{"v":2678,"d":"2678.00"}},"5A","A",null,"EOL 31.12.2026",{"$f":"VLOOKUP(B163,'Fire EN 54'!$D$5:$I$508,6,0)","v":"3"},"-","CH",{"$f":"VLOOKUP(B163,'Fire EN 54 FX 4,704'!$D$5:$L$500,9,0)","v":85311030000},{"$f":"VLOOKUP(B163,'Fire EN 54 FX 4,704'!$D$5:$O$500,12,0)","v":"0.124"}]
[null,"F.01U.332.583","FDB201","Podstawa do podwójnej czujki optycznej OOH740-A9-EX w wersji EX",{"$f":"VLOOKUP(B164,'Fire EN 54'!$D$5:$H$508,5,0)","v":{"v":161,"d":"161.00"}},"5A","A",null,"EOL 31.12.2026",{"$f":"VLOOKUP(B164,'Fire EN 54'!$D$5:$I$508,6,0)","v":"3"},"-","CH",{"$f":"VLOOKUP(B164,'Fire EN 54 FX 4,704'!$D$5:$L$500,9,0)","v":85319085900},{"$f":"VLOOKUP(B164,'Fire EN 54 FX 4,704'!$D$5:$O$500,12,0)","v":"0.025"}]
[null,"F.01U.335.165","FDB291","Podstawa montaż powierzchniowy",{"$f":"VLOOKUP(B165,'Fire EN 54'!$D$5:$H$508,5,0)","v":{"v":119,"d":"119.00"}},"5A","A",null,"EOL 31.12.2026",{"$f":"VLOOKUP(B165,'Fire EN 54'!$D$5:$I$508,6,0)","v":"3"},"-","CH",{"$f":"VLOOKUP(B165,'Fire EN 54 FX 4,704'!$D$5:$L$500,9,0)","v":85319000000},{"$f":"VLOOKUP(B165,'Fire EN 54 FX 4,704'!$D$5:$O$500,12,0)","v":"0.036"}]
[null,"F.01U.335.589","FDB295","Podstawa montaz powierzchniowy z zabezpieczeniem przeciw wilgoci",{"$f":"VLOOKUP(B166,'Fire EN 54'!$D$5:$H$508,5,0)","v":{"v":458,"d":"458.00"}},"5A","A",null,"EOL 31.12.2026",{"$f":"VLOOKUP(B166,'Fire EN 54'!$D$5:$I$508,6,0)","v":"3"},"-","CN",{"$f":"VLOOKUP(B166,'Fire EN 54 FX 4,704'!$D$5:$L$500,9,0)","v":85319000000},{"$f":"VLOOKUP(B166,'Fire EN 54 FX 4,704'!$D$5:$O$500,12,0)","v":"0.286"}]
[null,"F.01U.335.595","FDB295M","Metalowy dławik kablowy M20x1.5",{"$f":"VLOOKUP(B167,'Fire EN 54'!$D$5:$H$508,5,0)","v":{"v":262,"d":"262.00"}},"5A","A","Minimalna wielkość zamówienia 10 sztuk lub wielokrotność 10. Jeżeli potrzebujesz 30 sztuk zamawiasz 30 ","EOL 31.12.2026",{"$f":"VLOOKUP(B167,'Fire EN 54'!$D$5:$I$508,6,0)","v":"3"},"-","CH",{"$f":"VLOOKUP(B167,'Fire EN 54 FX 4,704'!$D$5:$L$500,9,0)","v":90269000900},{"$f":"VLOOKUP(B167,'Fire EN 54 FX 4,704'!$D$5:$O$500,12,0)","v":"0.354"}]
[null,"F.01U.335.593","FDUD291","Narzędzie do demontowania czujek ",{"$f":"VLOOKUP(B168,'Fire EN 54'!$D$5:$H$508,5,0)","v":{"v":10238,"d":"10238.00"}},"5A","A",null,"EOL 31.12.2026",{"$f":"VLOOKUP(B168,'Fire EN 54'!$D$5:$I$508,6,0)","v":"3"},"-","CH",{"$f":"VLOOKUP(B168,'Fire EN 54 FX 4,704'!$D$5:$L$500,9,0)","v":90318080000},{"$f":"VLOOKUP(B168,'Fire EN 54 FX 4,704'!$D$5:$O$500,12,0)","v":"0.480"}]
[null,"F.01U.335.590","FDBZ291","Tabliczka znamionowa do nanoszenia oznakowania czujki",{"$f":"VLOOKUP(B169,'Fire EN 54'!$D$5:$H$508,5,0)","v":{"v":12,"d":"12.00"}},"5A","A","Minimalna wielkość zamówienia 10 sztuk lub wielokrotność 10. Jeżeli potrzebujesz 30 sztuk zamawiasz 30 ","EOL 31.12.2026",{"$f":"VLOOKUP(B169,'Fire EN 54'!$D$5:$I$508,6,0)","v":"3"},"-","CH",{"$f":"VLOOKUP(B169,'Fire EN 54 FX 4,704'!$D$5:$L$500,9,0)","v":85319000000},{"$f":"VLOOKUP(B169,'Fire EN 54 FX 4,704'!$D$5:$O$500,12,0)","v":"0.024"}]
[null,"F.01U.335.591","FDBZ293","Blokada czujki M3x6. W zestawie 2 klucze imbusowe.",{"$f":"VLOOKUP(B170,'Fire EN 54'!$D$5:$H$508,5,0)","v":{"v":5,"d":"5.00"}},"5A","A","Minimalna wielkość zamówienia 100 sztuk lub wielokrotność 100. Jeżeli potrzebujesz 60 sztuk zamawiasz 100 ","EOL 31.12.2026",{"$f":"VLOOKUP(B170,'Fire EN 54'!$D$5:$I$508,6,0)","v":"3"},"-","CH",{"$f":"VLOOKUP(B170,'Fire EN 54 FX 4,704'!$D$5:$L$500,9,0)","v":85319000000},{"$f":"VLOOKUP(B170,'Fire EN 54 FX 4,704'!$D$5:$O$500,12,0)","v":"0.026"}]
[null,"F.01U.335.592","FDBZ295","Uszczelka do OOH740-A9-Ex",{"$f":"VLOOKUP(B171,'Fire EN 54'!$D$5:$H$508,5,0)","v":{"v":95,"d":"95.00"}},"5A","A",null,"EOL 31.12.2026",{"$f":"VLOOKUP(B171,'Fire EN 54'!$D$5:$I$508,6,0)","v":"3"},"-","CH",{"$f":"VLOOKUP(B171,'Fire EN 54 FX 4,704'!$D$5:$L$500,9,0)","v":40169300900},{"$f":"VLOOKUP(B171,'Fire EN 54 FX 4,704'!$D$5:$O$500,12,0)","v":"0.037"}]
[null,"F.01U.335.594","FDZ291","Osłona zabezpieczająca przed kurzem - cena za 1sztukę. ",{"$f":"VLOOKUP(B172,'Fire EN 54'!$D$5:$H$508,5,0)","v":{"v":18,"d":"18.00"}},"5A","A","Minimalna wielkość zamówienia 10 sztuk lub wielokrotność 10. Jeżeli potrzebujesz 30 sztuk zamawiasz 30 ","EOL 31.12.2026",{"$f":"VLOOKUP(B172,'Fire EN 54'!$D$5:$I$508,6,0)","v":"3"},"-","CH",{"$f":"VLOOKUP(B172,'Fire EN 54 FX 4,704'!$D$5:$L$500,9,0)","v":85319000000},{"$f":"VLOOKUP(B172,'Fire EN 54 FX 4,704'!$D$5:$O$500,12,0)","v":"0.045"}]
[null,"4.998.112.084","DM1103B-EX","ROP w wersji EX",{"$f":"VLOOKUP(B173,'Fire EN 54'!$D$5:$H$508,5,0)","v":{"v":1923,"d":"1923.00"}},"5A","A","Uwaga! Brak wymaganego Świadectwa Dopuszczenia.","EOL 31.12.2026",{"$f":"VLOOKUP(B173,'Fire EN 54'!$D$5:$I$508,6,0)","v":"3"},"-","DE",{"$f":"VLOOKUP(B173,'Fire EN 54 FX 4,704'!$D$5:$L$500,9,0)","v":8536501999},{"$f":"VLOOKUP(B173,'Fire EN 54 FX 4,704'!$D$5:$O$500,12,0)","v":"0.333"}]
[null,"4.998.112.085","SB3","Bariera iskrobezpieczna SB3 wraz z modułem DCA1192","Zapytaj o cene przed zamówieniem","5A","A",null,"EOL 31.03.2026",3,"-","DE",{"$f":"VLOOKUP(B174,'Fire EN 54 FX 4,704'!$D$5:$L$500,9,0)","v":8536909599},{"$f":"VLOOKUP(B174,'Fire EN 54 FX 4,704'!$D$5:$O$500,12,0)","v":"1.19"}]
["Video Detecja "]
[null,"F.01U.406.348","FCS-8000-VFD-I","AI-VFD Bullet 4MP 4.4-10mm IP67- kamera do inteligentnej wideo detekcji pożaru.",{"$f":"VLOOKUP(B176,'Fire EN 54'!$D$5:$H$508,5,0)","v":{"v":34014,"d":"34014.00"}},"5A","N/a",null,null,{"$f":"VLOOKUP(B176,'Fire EN 54'!$D$5:$I$508,6,0)","v":"3"},"-","PT",{"$f":"VLOOKUP(B176,'Fire EN 54 FX 4,704'!$D$5:$L$500,9,0)","v":85258900},{"$f":"VLOOKUP(B176,'Fire EN 54 FX 4,704'!$D$5:$O$500,12,0)","v":"3.285"}]
[null,"F.01U.317.536","FCS-8000-VFD-B","AVIOTEC IP starlight 8000 - kamera do inteligentnej wideo detekcji pożaru. ",{"$f":"VLOOKUP(B177,'Fire EN 54'!$D$5:$H$508,5,0)","v":{"v":34014,"d":"34014.00"}},"5A","N/a",null,null,{"$f":"VLOOKUP(B177,#REF!,5,0)","v":{"$error":"#REF!"}},"-","PT",{"$f":"VLOOKUP(B177,'Fire EN 54 FX 4,704'!$D$5:$L$500,9,0)","v":8525801931},{"$f":"VLOOKUP(B177,'Fire EN 54 FX 4,704'!$D$5:$O$500,12,0)","v":"1.196"}]
["Czujki bezprzewodowe"]
[null,"F.01U.349.134","FWI-270","Moduł LSN do urządzeń bezprzewodowych",{"$f":"VLOOKUP(B179,'Fire EN 54'!$D$5:$H$508,5,0)","v":{"v":5223,"d":"5223.00"}},"5A","B",null,null,{"$f":"VLOOKUP(B179,'Fire EN 54'!$D$5:$I$508,6,0)","v":"3"},"-","PT",{"$f":"VLOOKUP(B179,'Fire EN 54 FX 4,704'!$D$5:$L$500,9,0)","v":8517620000},{"$f":"VLOOKUP(B179,'Fire EN 54 FX 4,704'!$D$5:$O$500,12,0)","v":"0.260"}]
[null,"F.01U.349.135","FDOOT271-O","Czujka bezprzewodowa optyczno-termiczna",{"$f":"VLOOKUP(B180,'Fire EN 54'!$D$5:$H$508,5,0)","v":{"v":3003,"d":"3003.00"}},"5A","B",null,null,{"$f":"VLOOKUP(B180,'Fire EN 54'!$D$5:$I$508,6,0)","v":"3"},"-","CH",{"$f":"VLOOKUP(B180,'Fire EN 54 FX 4,704'!$D$5:$L$500,9,0)","v":8531900000},{"$f":"VLOOKUP(B180,'Fire EN 54 FX 4,704'!$D$5:$O$500,12,0)","v":"0.134"}]
[null,"F.01U.349.136","FDB271","Podstawa czujki bezprzewodowej",{"$f":"VLOOKUP(B181,'Fire EN 54'!$D$5:$H$508,5,0)","v":{"v":57,"d":"57.00"}},"5A","B",null,null,{"$f":"VLOOKUP(B181,'Fire EN 54'!$D$5:$I$508,6,0)","v":"3"},"-","CH",{"$f":"VLOOKUP(B181,'Fire EN 54 FX 4,704'!$D$5:$L$500,9,0)","v":8536909599},{"$f":"VLOOKUP(B181,'Fire EN 54 FX 4,704'!$D$5:$O$500,12,0)","v":"0.039"}]
[null,"F.01U.349.137","FDMH273-R","Obudowa bezprzewodowego ROP dwustadiowego",{"$f":"VLOOKUP(B182,'Fire EN 54'!$D$5:$H$508,5,0)","v":{"v":652,"d":"652.00"}},"5A","B",null,null,{"$f":"VLOOKUP(B182,'Fire EN 54'!$D$5:$I$508,6,0)","v":"3"},"-","CH",{"$f":"VLOOKUP(B182,'Fire EN 54 FX 4,704'!$D$5:$L$500,9,0)","v":8536501999},{"$f":"VLOOKUP(B182,'Fire EN 54 FX 4,704'!$D$5:$O$500,12,0)","v":"0.285"}]
[null,"F.01U.349.249","FDME273-O","Bezprzewodowy ROP dwustadiowy - elektronika",{"$f":"VLOOKUP(B183,'Fire EN 54'!$D$5:$H$508,5,0)","v":{"v":3768,"d":"3768.00"}},"5A","B",null,null,{"$f":"VLOOKUP(B183,'Fire EN 54'!$D$5:$I$508,6,0)","v":"3"},"-","CH",{"$f":"VLOOKUP(B183,'Fire EN 54 FX 4,704'!$D$5:$L$500,9,0)","v":8536501999},{"$f":"VLOOKUP(B183,'Fire EN 54 FX 4,704'!$D$5:$O$500,12,0)","v":"0.108"}]
[null,"F.01U.349.248","BAT3.6-10","Li-SOCl2 bateria 3.6V, 10 Ah",{"$f":"VLOOKUP(B184,'Fire EN 54'!$D$5:$H$508,5,0)","v":{"v":385,"d":"385.00"}},"5A","B",null,null,{"$f":"VLOOKUP(B184,'Fire EN 54'!$D$5:$I$508,6,0)","v":"1"},"-","CH",{"$f":"VLOOKUP(B184,'Fire EN 54 FX 4,704'!$D$5:$L$500,9,0)","v":8506501000},{"$f":"VLOOKUP(B184,'Fire EN 54 FX 4,704'!$D$5:$O$500,12,0)","v":"0.09"}]
[null,"F.01U.349.250","DMZ1196-AC","Zapasowa szybka do FDM273-O",{"$f":"VLOOKUP(B185,'Fire EN 54'!$D$5:$H$508,5,0)","v":{"v":53,"d":"53.00"}},"5A","B","Cena za sztukę. Zamówienie w paczkach 10 sztuk.",null,{"$f":"VLOOKUP(B185,'Fire EN 54'!$D$5:$I$508,6,0)","v":"3"},"-","CH",{"$f":"VLOOKUP(B185,'Fire EN 54 FX 4,704'!$D$5:$L$500,9,0)","v":3926909790},{"$f":"VLOOKUP(B185,'Fire EN 54 FX 4,704'!$D$5:$O$500,12,0)","v":"0.117"}]
[null,"F.01U.349.254","FDUZ227","MCL adapter USB",{"$f":"VLOOKUP(B186,'Fire EN 54'!$D$5:$H$508,5,0)","v":{"v":6232,"d":"6232.00"}},"5A","B",null,null,{"$f":"VLOOKUP(B186,'Fire EN 54'!$D$5:$I$508,6,0)","v":"3"},"-","CH",{"$f":"VLOOKUP(B186,'Fire EN 54 FX 4,704'!$D$5:$L$500,9,0)","v":8536909599},{"$f":"VLOOKUP(B186,'Fire EN 54 FX 4,704'!$D$5:$O$500,12,0)","v":"0.197"}]
["ROPy adresowalne LSNi"]
["ROP typu FMC-210 i powiązane akcesoria"]
[null,"F.01U.011.956","FMC-210-DM-G-R","ROP czerwony, wewnętrzny",{"$f":"VLOOKUP(B189,'Fire EN 54'!$D$5:$H$508,5,0)","v":{"v":292,"d":"292.00"}},"5A",1,null,null,{"$f":"VLOOKUP(B189,'Fire EN 54'!$D$5:$I$508,6,0)","v":"3"},"-","CN",{"$f":"VLOOKUP(B189,'Fire EN 54 FX 4,704'!$D$5:$L$500,9,0)","v":8536501999},{"$f":"VLOOKUP(B189,'Fire EN 54 FX 4,704'!$D$5:$O$500,12,0)","v":"0.237"}]
[null,"F.01U.011.958","FMC-210-DM-H-R","ROP czerwony, zewnętrzny",{"$f":"VLOOKUP(B190,'Fire EN 54'!$D$5:$H$508,5,0)","v":{"v":729,"d":"729.00"}},"5A","A",null,null,{"$f":"VLOOKUP(B190,'Fire EN 54'!$D$5:$I$508,6,0)","v":"3"},"-","CN",{"$f":"VLOOKUP(B190,'Fire EN 54 FX 4,704'!$D$5:$L$500,9,0)","v":8536501999},{"$f":"VLOOKUP(B190,'Fire EN 54 FX 4,704'!$D$5:$O$500,12,0)","v":"0.244"}]
[null,"F.01U.025.845","FMC-SPGL-DEIL","Zapasowa szybka do Ręcznych OstrzeGaczy Pożarowych  MPC- 5 sztuk ",{"$f":"VLOOKUP(B191,'Fire EN 54'!$D$5:$H$508,5,0)","v":{"v":159,"d":"159.00"}},"5A","A",null,null,{"$f":"VLOOKUP(B191,'Fire EN 54'!$D$5:$I$508,6,0)","v":"3"},"-","DE",{"$f":"VLOOKUP(B191,'Fire EN 54 FX 4,704'!$D$5:$L$500,9,0)","v":70060090},{"$f":"VLOOKUP(B191,'Fire EN 54 FX 4,704'!$D$5:$O$500,12,0)","v":"0.075"}]
[null,"3.756.630.007","FMM-KEY-Form G/H","Klucz do Ręcznego Ostrzegacza Pożarowego",{"$f":"VLOOKUP(B192,'Fire EN 54'!$D$5:$H$508,5,0)","v":{"v":8,"d":"8.00"}},"5A","A",null,null,{"$f":"VLOOKUP(B192,'Fire EN 54'!$D$5:$I$508,6,0)","v":"3"},"-","HU",{"$f":"VLOOKUP(B192,'Fire EN 54 FX 4,704'!$D$5:$L$500,9,0)","v":85319010},{"$f":"VLOOKUP(B192,'Fire EN 54 FX 4,704'!$D$5:$O$500,12,0)","v":"0.017"}]
["ROP typu FMC-420 i powiązane akcesoria"]
[null,"F.01U.012.781","FMC-420RW-GSGRD","ROP wewnętrzny, czerwony, montaż natynkowy",{"$f":"VLOOKUP(B194,'Fire EN 54'!$D$5:$H$508,5,0)","v":{"v":342,"d":"342.00"}},"5A","A",null,null,{"$f":"VLOOKUP(B194,'Fire EN 54'!$D$5:$I$508,6,0)","v":"3"},"-","CN",{"$f":"VLOOKUP(B194,'Fire EN 54 FX 4,704'!$D$5:$L$500,9,0)","v":8536501999},{"$f":"VLOOKUP(B194,'Fire EN 54 FX 4,704'!$D$5:$O$500,12,0)","v":"0.835"}]
[null,"F.01U.012.782","FMC-420RW-GSRRD","ROP wewnętrzny, czerwony, montaż natynkowy, z możliwością kasowania alarmu",{"$f":"VLOOKUP(B195,'Fire EN 54'!$D$5:$H$508,5,0)","v":{"v":342,"d":"342.00"}},"5A","A",null,null,{"$f":"VLOOKUP(B195,'Fire EN 54'!$D$5:$I$508,6,0)","v":"3"},"-","CN",{"$f":"VLOOKUP(B195,'Fire EN 54 FX 4,704'!$D$5:$L$500,9,0)","v":8536501999},{"$f":"VLOOKUP(B195,'Fire EN 54 FX 4,704'!$D$5:$O$500,12,0)","v":"0.183"}]
[null,"F.01U.012.783","FMC-420RW-GFGRD","ROP wewnętrzny, czerwony, montaż podtynkowy",{"$f":"VLOOKUP(B196,'Fire EN 54'!$D$5:$H$508,5,0)","v":{"v":342,"d":"342.00"}},"5A","A",null,null,{"$f":"VLOOKUP(B196,'Fire EN 54'!$D$5:$I$508,6,0)","v":"3"},"-","CN",{"$f":"VLOOKUP(B196,'Fire EN 54 FX 4,704'!$D$5:$L$500,9,0)","v":8536501999},{"$f":"VLOOKUP(B196,'Fire EN 54 FX 4,704'!$D$5:$O$500,12,0)","v":"0.183"}]
[null,"F.01U.012.784","FMC-420RW-GFRRD","ROP wewnętrzny, czerwony, montaż podtynkowy, z możliwością kasowania alarmu",{"$f":"VLOOKUP(B197,'Fire EN 54'!$D$5:$H$508,5,0)","v":{"v":342,"d":"342.00"}},"5A","A",null,null,{"$f":"VLOOKUP(B197,'Fire EN 54'!$D$5:$I$508,6,0)","v":"3"},"-","CN",{"$f":"VLOOKUP(B197,'Fire EN 54 FX 4,704'!$D$5:$L$500,9,0)","v":8536501999},{"$f":"VLOOKUP(B197,'Fire EN 54 FX 4,704'!$D$5:$O$500,12,0)","v":"0.17"}]
[null,"F.01U.073.045","FMC-BEZEL-RD","Ramka montażowa dla FMC-420RW-GFGRD oraz FMC-420RW-GFRRD",{"$f":"VLOOKUP(B198,'Fire EN 54'!$D$5:$H$508,5,0)","v":{"v":141,"d":"141.00"}},"5A","A",null,null,{"$f":"VLOOKUP(B198,'Fire EN 54'!$D$5:$I$508,6,0)","v":"3"},"-","CN",{"$f":"VLOOKUP(B198,'Fire EN 54 FX 4,704'!$D$5:$L$500,9,0)","v":3926909790},{"$f":"VLOOKUP(B198,'Fire EN 54 FX 4,704'!$D$5:$O$500,12,0)","v":"0.175"}]
[null,"F.01U.013.504","FMC-SPGL-RW","Opakowanie 5 sztuk zapasowych szybek do FMC-420RW-GSGRD oraz FMC-420RW-GFGRD",{"$f":"VLOOKUP(B199,'Fire EN 54'!$D$5:$H$508,5,0)","v":{"v":235,"d":"235.00"}},"5A","A","1 opakowanie zawiera 5 sztuk. Jeśli potrzebujesz 10 sztuk, zamów 2",null,{"$f":"VLOOKUP(B199,'Fire EN 54'!$D$5:$I$508,6,0)","v":"3"},"-","CN",{"$f":"VLOOKUP(B199,'Fire EN 54 FX 4,704'!$D$5:$L$500,9,0)","v":70060090},{"$f":"VLOOKUP(B199,'Fire EN 54 FX 4,704'!$D$5:$O$500,12,0)","v":"0.07"}]
[null,"F.01U.028.227","FMC-KEY-RW","Kluczyk testowy do ROP",{"$f":"VLOOKUP(B200,'Fire EN 54'!$D$5:$H$508,5,0)","v":{"v":6,"d":"6.00"}},"5A","A",null,null,{"$f":"VLOOKUP(B200,'Fire EN 54'!$D$5:$I$508,6,0)","v":"3"},"-","CN",{"$f":"VLOOKUP(B200,'Fire EN 54 FX 4,704'!$D$5:$L$500,9,0)","v":3926909790},{"$f":"VLOOKUP(B200,'Fire EN 54 FX 4,704'!$D$5:$O$500,12,0)","v":"0.001"}]
[null,"F.01U.028.194","FMC-FLAP-RW","Klapka chroniąca przed omyłkową aktywacją (opakowanie 5 sztuk)",{"$f":"VLOOKUP(B201,'Fire EN 54'!$D$5:$H$508,5,0)","v":{"v":86,"d":"86.00"}},"5A","C","1 opakowanie zawiera 5 sztuk. Jeśli potrzebujesz 10 sztuk, zamów 2",null,{"$f":"VLOOKUP(B201,'Fire EN 54'!$D$5:$I$508,6,0)","v":"3"},"-","CN",{"$f":"VLOOKUP(B201,'Fire EN 54 FX 4,704'!$D$5:$L$500,9,0)","v":3926909790},{"$f":"VLOOKUP(B201,'Fire EN 54 FX 4,704'!$D$5:$O$500,12,0)","v":"0.099"}]
["Moduły adresowalne LSNi"]
["Seria 420"]
[null,"F.01U.508.710","FLM-420-RHV-S","Moduł wyjść przekaźnikowych wysokonapięciowych 2 wyjścia/2 wejścia , z obudową",{"$f":"VLOOKUP(B204,'Fire EN 54'!$D$5:$H$508,5,0)","v":{"v":955,"d":"955.00"}},"5A",1,null,null,{"$f":"VLOOKUP(B204,'Fire EN 54'!$D$5:$I$508,6,0)","v":"5"},"-","CN",{"$f":"VLOOKUP(B204,'Fire EN 54 FX 4,704'!$D$5:$L$500,9,0)","v":8517620000},{"$f":"VLOOKUP(B204,'Fire EN 54 FX 4,704'!$D$5:$O$500,12,0)","v":"0.5"}]
[null,"F.01U.508.714","FLM-420-RHV-D","Moduł wyjść przekaźnikowych wysokonapięciowych 2 wyjścia/2 wejścia, montaz szyna DIN",{"$f":"VLOOKUP(B205,'Fire EN 54'!$D$5:$H$508,5,0)","v":{"v":868,"d":"868.00"}},"5A","A",null,null,{"$f":"VLOOKUP(B205,'Fire EN 54'!$D$5:$I$508,6,0)","v":"5"},"-","CN",{"$f":"VLOOKUP(B205,'Fire EN 54 FX 4,704'!$D$5:$L$500,9,0)","v":8517620000},{"$f":"VLOOKUP(B205,'Fire EN 54 FX 4,704'!$D$5:$O$500,12,0)","v":"0.324"}]
[null,"F.01U.508.711","FLM-I 420-S","Izolator zwarć",{"$f":"VLOOKUP(B206,'Fire EN 54'!$D$5:$H$508,5,0)","v":{"v":411,"d":"411.00"}},"5A","A",null,null,{"$f":"VLOOKUP(B206,'Fire EN 54'!$D$5:$I$508,6,0)","v":"5"},"-","CN",{"$f":"VLOOKUP(B206,'Fire EN 54 FX 4,704'!$D$5:$L$500,9,0)","v":8517620000},{"$f":"VLOOKUP(B206,'Fire EN 54 FX 4,704'!$D$5:$O$500,12,0)","v":"0.466"}]
[null,"F.01U.012.542","FLM-420-I2-W","Moduł wejść (2 wejścia), montaz ścienny ",{"$f":"VLOOKUP(B207,'Fire EN 54'!$D$5:$H$508,5,0)","v":{"v":523,"d":"523.00"}},"5A","A",null,null,{"$f":"VLOOKUP(B207,'Fire EN 54'!$D$5:$I$508,6,0)","v":"5"},"-","CN",{"$f":"VLOOKUP(B207,'Fire EN 54 FX 4,704'!$D$5:$L$500,9,0)","v":8517620000},{"$f":"VLOOKUP(B207,'Fire EN 54 FX 4,704'!$D$5:$O$500,12,0)","v":"0.116"}]
[null,"F.01U.012.571","FLM-420-I2-E","Moduł wejśc (2 wejścia), montarz wbudowany ",{"$f":"VLOOKUP(B208,'Fire EN 54'!$D$5:$H$508,5,0)","v":{"v":508,"d":"508.00"}},"5A","A",null,null,{"$f":"VLOOKUP(B208,'Fire EN 54'!$D$5:$I$508,6,0)","v":"5"},"-","CN",{"$f":"VLOOKUP(B208,'Fire EN 54 FX 4,704'!$D$5:$L$500,9,0)","v":8517620000},{"$f":"VLOOKUP(B208,'Fire EN 54 FX 4,704'!$D$5:$O$500,12,0)","v":"0.099"}]
[null,"F.01U.012.578","FLM-420-I2-D","Moduł wejśc (2 wejścia), montaz szyna DIN ",{"$f":"VLOOKUP(B209,'Fire EN 54'!$D$5:$H$508,5,0)","v":{"v":628,"d":"628.00"}},"5A","A",null,null,{"$f":"VLOOKUP(B209,'Fire EN 54'!$D$5:$I$508,6,0)","v":"5"},"-","CN",{"$f":"VLOOKUP(B209,'Fire EN 54 FX 4,704'!$D$5:$L$500,9,0)","v":8517620000},{"$f":"VLOOKUP(B209,'Fire EN 54 FX 4,704'!$D$5:$O$500,12,0)","v":"0.306"}]
[null,"F.01U.012.591","FLM-420-RLV1-E","Moduł wyjść przekaźnikowych niskonapięciowych (1 przekaźnik), montaż wbudowany",{"$f":"VLOOKUP(B210,'Fire EN 54'!$D$5:$H$508,5,0)","v":{"v":508,"d":"508.00"}},"5A","A",null,null,{"$f":"VLOOKUP(B210,'Fire EN 54'!$D$5:$I$508,6,0)","v":"5"},"-","CN",{"$f":"VLOOKUP(B210,'Fire EN 54 FX 4,704'!$D$5:$L$500,9,0)","v":8517620000},{"$f":"VLOOKUP(B210,'Fire EN 54 FX 4,704'!$D$5:$O$500,12,0)","v":"0.106"}]
[null,"F.01U.012.594","FLM-420-RLV1-D","Moduł wyjść przekaźnikowych niskonapięciowych (1 przekaźnik), montaż szyna DIN ",{"$f":"VLOOKUP(B211,'Fire EN 54'!$D$5:$H$508,5,0)","v":{"v":628,"d":"628.00"}},"5A","A",null,null,{"$f":"VLOOKUP(B211,'Fire EN 54'!$D$5:$I$508,6,0)","v":"5"},"-","CN",{"$f":"VLOOKUP(B211,'Fire EN 54 FX 4,704'!$D$5:$L$500,9,0)","v":8517620000},{"$f":"VLOOKUP(B211,'Fire EN 54 FX 4,704'!$D$5:$O$500,12,0)","v":"0.302"}]
[null,"F.01U.012.534","FLM-420/4-CON-S","Modu 2ł linii konwencjonalnych z obudową",{"$f":"VLOOKUP(B212,'Fire EN 54'!$D$5:$H$508,5,0)","v":{"v":868,"d":"868.00"}},"5A",1,null,null,{"$f":"VLOOKUP(B212,'Fire EN 54'!$D$5:$I$508,6,0)","v":"5"},"-","CN",{"$f":"VLOOKUP(B212,'Fire EN 54 FX 4,704'!$D$5:$L$500,9,0)","v":8517620000},{"$f":"VLOOKUP(B212,'Fire EN 54 FX 4,704'!$D$5:$O$500,12,0)","v":"0.504"}]
[null,"F.01U.012.535","FLM-420/4-CON-D","Moduł 2 linii konwencjonalnych , montaż szyna DIN ",{"$f":"VLOOKUP(B213,'Fire EN 54'!$D$5:$H$508,5,0)","v":{"v":834,"d":"834.00"}},"5A","A",null,null,{"$f":"VLOOKUP(B213,'Fire EN 54'!$D$5:$I$508,6,0)","v":"5"},"-","CN",{"$f":"VLOOKUP(B213,'Fire EN 54 FX 4,704'!$D$5:$L$500,9,0)","v":8517620000},{"$f":"VLOOKUP(B213,'Fire EN 54 FX 4,704'!$D$5:$O$500,12,0)","v":"0.115"}]
[null,"F.01U.033.247","FLM-420-RLV8-S","Moduł 8 wyjśc przekaźnikowych niskonapięciowych wraz z obudową",{"$f":"VLOOKUP(B214,'Fire EN 54'!$D$5:$H$508,5,0)","v":{"v":1342,"d":"1342.00"}},"5A",1,null,null,{"$f":"VLOOKUP(B214,'Fire EN 54'!$D$5:$I$508,6,0)","v":"5"},"-","CN",{"$f":"VLOOKUP(B214,'Fire EN 54 FX 4,704'!$D$5:$L$500,9,0)","v":8517620000},{"$f":"VLOOKUP(B214,'Fire EN 54 FX 4,704'!$D$5:$O$500,12,0)","v":"0.648"}]
[null,"F.01U.033.251","FLM-420-I8R1-S","Moduł 8 wejśći 1 wyjścia przekaźnikowego niskonapięciowego wraz z obudową",{"$f":"VLOOKUP(B215,'Fire EN 54'!$D$5:$H$508,5,0)","v":{"v":1069,"d":"1069.00"}},"5A",1,null,null,{"$f":"VLOOKUP(B215,'Fire EN 54'!$D$5:$I$508,6,0)","v":"5"},"-","CN",{"$f":"VLOOKUP(B215,'Fire EN 54 FX 4,704'!$D$5:$L$500,9,0)","v":8517620000},{"$f":"VLOOKUP(B215,'Fire EN 54 FX 4,704'!$D$5:$O$500,12,0)","v":"0.666"}]
[null,"F.01U.080.970","FLM-420-RLE-S","Moduł 2 wejścia jedno wyjście dedykowany do systemy gaszenia montraż w obudowie lub szynie DIN ",{"$f":"VLOOKUP(B216,'Fire EN 54'!$D$5:$H$508,5,0)","v":{"v":911,"d":"911.00"}},"5A","A",null,null,{"$f":"VLOOKUP(B216,'Fire EN 54'!$D$5:$I$508,6,0)","v":"5"},"-","CN",{"$f":"VLOOKUP(B216,'Fire EN 54 FX 4,704'!$D$5:$L$500,9,0)","v":8536501999},{"$f":"VLOOKUP(B216,'Fire EN 54 FX 4,704'!$D$5:$O$500,12,0)","v":"0.45"}]
[null,"F.01U.012.595","FMX-IFB55-S","Obudowa  do modułu do instalacji naściennej ",{"$f":"VLOOKUP(B217,'Fire EN 54'!$D$5:$H$508,5,0)","v":{"v":35,"d":"35.00"}},"5A","A",null,null,{"$f":"VLOOKUP(B217,'Fire EN 54'!$D$5:$I$508,6,0)","v":"5"},"-","CN",{"$f":"VLOOKUP(B217,'Fire EN 54 FX 4,704'!$D$5:$L$500,9,0)","v":3926909790},{"$f":"VLOOKUP(B217,'Fire EN 54 FX 4,704'!$D$5:$O$500,12,0)","v":"0.029"}]
[null,"F.01U.029.614","FLM-IFB126-S","Obudowa do modułów serii FLM420 ",{"$f":"VLOOKUP(B218,'Fire EN 54'!$D$5:$H$508,5,0)","v":{"v":104,"d":"104.00"}},"5A",1,null,null,{"$f":"VLOOKUP(B218,'Fire EN 54'!$D$5:$I$508,6,0)","v":"5"},"-","CN",{"$f":"VLOOKUP(B218,'Fire EN 54 FX 4,704'!$D$5:$L$500,9,0)","v":3926909790},{"$f":"VLOOKUP(B218,'Fire EN 54 FX 4,704'!$D$5:$O$500,12,0)","v":"0.349"}]
[null,"F.01U.096.884","FLM-420-EOL2W-W","EOL do modułów LSN , montaz ścienny ",{"$f":"VLOOKUP(B219,'Fire EN 54'!$D$5:$H$508,5,0)","v":{"v":405,"d":"405.00"}},"5A","A",null,null,{"$f":"VLOOKUP(B219,'Fire EN 54'!$D$5:$I$508,6,0)","v":"5"},"-","CN",{"$f":"VLOOKUP(B219,'Fire EN 54 FX 4,704'!$D$5:$L$500,9,0)","v":8537109199},{"$f":"VLOOKUP(B219,'Fire EN 54 FX 4,704'!$D$5:$O$500,12,0)","v":"0.12"}]
[null,"F.01U.083.617","FLM-420-EOL4W-S","EOL do moduło EOL 4 żyłowy, montaż powierzchniowy ",{"$f":"VLOOKUP(B220,'Fire EN 54'!$D$5:$H$508,5,0)","v":{"v":809,"d":"809.00"}},"5A","A",null,null,{"$f":"VLOOKUP(B220,'Fire EN 54'!$D$5:$I$508,6,0)","v":"5"},"-","CN",{"$f":"VLOOKUP(B220,'Fire EN 54 FX 4,704'!$D$5:$L$500,9,0)","v":8536501999},{"$f":"VLOOKUP(B220,'Fire EN 54 FX 4,704'!$D$5:$O$500,12,0)","v":"0.48"}]
[null,"F.01U.083.618","FLM-420-EOL4W-D","EOL do moduło EOL 4 żyłowy do szyny DIN ",{"$f":"VLOOKUP(B221,'Fire EN 54'!$D$5:$H$508,5,0)","v":{"v":742,"d":"742.00"}},"5A","A",null,null,{"$f":"VLOOKUP(B221,'Fire EN 54'!$D$5:$I$508,6,0)","v":"5"},"-","CN",{"$f":"VLOOKUP(B221,'Fire EN 54 FX 4,704'!$D$5:$L$500,9,0)","v":8536501999},{"$f":"VLOOKUP(B221,'Fire EN 54 FX 4,704'!$D$5:$O$500,12,0)","v":"0.28"}]
["Seria 430"]
[null,"F.01U.402.681","FLM-430-I2M1","Moduł interfejsu IO - 2 wejścia 1 wyjście",{"$f":"VLOOKUP(B223,'Fire EN 54'!$D$5:$H$508,5,0)","v":{"v":1050,"d":"1050.00"}},"5A","A",null,null,{"$f":"VLOOKUP(B223,'Fire EN 54'!$D$5:$I$508,6,0)","v":"5"},null,"PT",{"$f":"VLOOKUP(B223,'Fire EN 54 FX 4,704'!$D$5:$L$500,9,0)","v":85371098},{"$f":"VLOOKUP(B223,'Fire EN 54 FX 4,704'!$D$5:$O$500,12,0)","v":"0.135"}]
[null,"F.01U.402.682","FLM-430-SMB","Obudowa do montażu natynkowego",{"$f":"VLOOKUP(B224,'Fire EN 54'!$D$5:$H$508,5,0)","v":{"v":225,"d":"225.00"}},"5A","A",null,null,{"$f":"VLOOKUP(B224,'Fire EN 54'!$D$5:$I$508,6,0)","v":"5"},null,"PT",{"$f":"VLOOKUP(B224,'Fire EN 54 FX 4,704'!$D$5:$L$500,9,0)","v":39269097},{"$f":"VLOOKUP(B224,'Fire EN 54 FX 4,704'!$D$5:$O$500,12,0)","v":"0.317"}]
[null,"F.01U.402.683","FLM-430-CLIP","Uchwyt DIN dla modułu FLM-430-I2M1",{"$f":"VLOOKUP(B225,'Fire EN 54'!$D$5:$H$508,5,0)","v":{"v":90,"d":"90.00"}},"5A","A","Jeden zestaw zawiera 5 uchwytów i 11 śrub",null,{"$f":"VLOOKUP(B225,'Fire EN 54'!$D$5:$I$508,6,0)","v":"5"},null,"PT",{"$f":"VLOOKUP(B225,'Fire EN 54 FX 4,704'!$D$5:$L$500,9,0)","v":39269097},{"$f":"VLOOKUP(B225,'Fire EN 54 FX 4,704'!$D$5:$O$500,12,0)","v":"0.021"}]
[null,"F.01U.402.684","FLM-430-CABLE","Kabel połączeniowy LSNi do instalacji modułów obok siebie",{"$f":"VLOOKUP(B226,'Fire EN 54'!$D$5:$H$508,5,0)","v":{"v":150,"d":"150.00"}},"5A","A","Jeden zestaw zawiera 5 sztuk kabli",null,{"$f":"VLOOKUP(B226,'Fire EN 54'!$D$5:$I$508,6,0)","v":"5"},null,"PT",{"$f":"VLOOKUP(B226,'Fire EN 54 FX 4,704'!$D$5:$L$500,9,0)","v":85444290},{"$f":"VLOOKUP(B226,'Fire EN 54 FX 4,704'!$D$5:$O$500,12,0)","v":"0.034"}]
["Sygnalizatory "]
["Akustyczno - optytczne (adresowalne)"]
[null,"F.01U.359.435","FNX-425U-RFRD","Sygnalizator optyczno-akustyczny, czerwony, światło czerwone",{"$f":"VLOOKUP(B229,'Fire EN 54'!$D$5:$H$508,5,0)","v":{"v":1831,"d":"1831.00"}},"5A","A","Bateria w zestawie, czerwona pokrywa dostarczana w zestawie",null,{"$f":"VLOOKUP(B229,'Fire EN 54'!$D$5:$I$508,6,0)","v":"3"},"-","DE",{"$f":"VLOOKUP(B229,'Fire EN 54 FX 4,704'!$D$5:$L$500,9,0)","v":"8531103000"},{"$f":"VLOOKUP(B229,'Fire EN 54 FX 4,704'!$D$5:$O$500,12,0)","v":"0.473"}]
[null,"F.01U.359.438","FNX-425U-BAT","Zestaw baterii dla AVENAR all-in-one 4000",{"$f":"VLOOKUP(B230,'Fire EN 54'!$D$5:$H$508,5,0)","v":{"v":3976,"d":"3976.00"}},"5A","A","1 poakowanie zawiera 10 batteri; jeśli potrzebujesz 60 szt. zamów 6 opakowania",null,{"$f":"VLOOKUP(B230,'Fire EN 54'!$D$5:$I$508,6,0)","v":"1"},"-","DE",{"$f":"VLOOKUP(B230,'Fire EN 54 FX 4,704'!$D$5:$L$500,9,0)","v":"8506501090"},{"$f":"VLOOKUP(B230,'Fire EN 54 FX 4,704'!$D$5:$O$500,12,0)","v":"0.051"}]
["Akustyczne (konwencjonalne)"]
[null,"F.01U.143.878","FNM-320-SRD","Sygnalizator akustyczny, czerwony, montaż powierzchniowy",{"$f":"VLOOKUP(B232,'Fire EN 54'!$D$5:$H$508,5,0)","v":{"v":303,"d":"303.00"}},"5A","A",null,null,{"$f":"VLOOKUP(B232,'Fire EN 54'!$D$5:$I$508,6,0)","v":"3"},"-","GB",{"$f":"VLOOKUP(B232,'Fire EN 54 FX 4,704'!$D$5:$L$500,9,0)","v":8531103000},{"$f":"VLOOKUP(B232,'Fire EN 54 FX 4,704'!$D$5:$O$500,12,0)","v":"0.252"}]
[null,"F.01U.143.879","FNM-320-FRD","Sygnalizator akustyczny, czerwony, montaż płaski",{"$f":"VLOOKUP(B233,'Fire EN 54'!$D$5:$H$508,5,0)","v":{"v":284,"d":"284.00"}},"5A","A",null,null,{"$f":"VLOOKUP(B233,'Fire EN 54'!$D$5:$I$508,6,0)","v":"3"},"-","GB",{"$f":"VLOOKUP(B233,'Fire EN 54 FX 4,704'!$D$5:$L$500,9,0)","v":8531103000},{"$f":"VLOOKUP(B233,'Fire EN 54 FX 4,704'!$D$5:$O$500,12,0)","v":"0.238"}]
[null,"F.01U.143.880","FNM-320-SWH","Sygnalizator akustyczny, biały, montaż powierzchniowy",{"$f":"VLOOKUP(B234,'Fire EN 54'!$D$5:$H$508,5,0)","v":{"v":303,"d":"303.00"}},"5A","A",null,null,{"$f":"VLOOKUP(B234,'Fire EN 54'!$D$5:$I$508,6,0)","v":"3"},"-","GB",{"$f":"VLOOKUP(B234,'Fire EN 54 FX 4,704'!$D$5:$L$500,9,0)","v":8531103000},{"$f":"VLOOKUP(B234,'Fire EN 54 FX 4,704'!$D$5:$O$500,12,0)","v":"0.242"}]
[null,"F.01U.143.881","FNM-320-FWH","Sygnalizator akustyczny, biały, montaż płaski",{"$f":"VLOOKUP(B235,'Fire EN 54'!$D$5:$H$508,5,0)","v":{"v":284,"d":"284.00"}},"5A","A",null,null,{"$f":"VLOOKUP(B235,'Fire EN 54'!$D$5:$I$508,6,0)","v":"3"},"-","GB",{"$f":"VLOOKUP(B235,'Fire EN 54 FX 4,704'!$D$5:$L$500,9,0)","v":8531103000},{"$f":"VLOOKUP(B235,'Fire EN 54 FX 4,704'!$D$5:$O$500,12,0)","v":"0.238"}]
[null,"F.01U.143.882","FNM-320-LEDSRD","Sygnalizator akustyczny  z diodą LED, montaż powierzchniowy",{"$f":"VLOOKUP(B236,'Fire EN 54'!$D$5:$H$508,5,0)","v":{"v":652,"d":"652.00"}},"5A","A",null,"Uwaga! Brak wymaganego Świadectwa Dopuszczenia.",{"$f":"VLOOKUP(B236,'Fire EN 54'!$D$5:$I$508,6,0)","v":"3"},"-","GB",{"$f":"VLOOKUP(B236,'Fire EN 54 FX 4,704'!$D$5:$L$500,9,0)","v":8531103000},{"$f":"VLOOKUP(B236,'Fire EN 54 FX 4,704'!$D$5:$O$500,12,0)","v":"0.292"}]
[null,"F.01U.288.471","ROLP-R-LX-W-RF","Sygnalizator akustyczno optyczny, podstawa czerwona, światło czerwone, montaz ścienny",{"$f":"VLOOKUP(B237,'Fire EN 54'!$D$5:$H$508,5,0)","v":{"v":748,"d":"748.00"}},"5A","A",null,null,{"$f":"VLOOKUP(B237,'Fire EN 54'!$D$5:$I$508,6,0)","v":"3"},"-","GB",{"$f":"VLOOKUP(B237,'Fire EN 54 FX 4,704'!$D$5:$L$500,9,0)","v":8531103000},{"$f":"VLOOKUP(B237,'Fire EN 54 FX 4,704'!$D$5:$O$500,12,0)","v":"0.283"}]
[null,"F.01U.393.222","PA 10-SSM","Przemysłowy sygnalizator akustyczny, wysoki",{"$f":"VLOOKUP(B238,'Fire EN 54'!$D$5:$H$508,5,0)","v":{"v":2650,"d":"2650.00"}},"5A","A",null,null,{"$f":"VLOOKUP(B238,'Fire EN 54'!$D$5:$I$508,6,0)","v":"3"},"-","DE",{"$f":"VLOOKUP(B238,'Fire EN 54 FX 4,704'!$D$5:$L$500,9,0)","v":85318070},{"$f":"VLOOKUP(B238,'Fire EN 54 FX 4,704'!$D$5:$O$500,12,0)","v":"1.060"}]
[null,"F.01U.393.223","PA 5","Przemysłowy sygnalizator akustyczny, niski",{"$f":"VLOOKUP(B239,'Fire EN 54'!$D$5:$H$508,5,0)","v":{"v":1592,"d":"1592.00"}},"5A","A",null,null,{"$f":"VLOOKUP(B239,'Fire EN 54'!$D$5:$I$508,6,0)","v":"3"},"-","DE",{"$f":"VLOOKUP(B239,'Fire EN 54 FX 4,704'!$D$5:$L$500,9,0)","v":85318070},{"$f":"VLOOKUP(B239,'Fire EN 54 FX 4,704'!$D$5:$O$500,12,0)","v":"0.640"}]
["Akustyczne LSNi (adresowalne)"]
[null,"F.01U.268.723","FNM-420V-A-RD","Sygnalizator akustyczno-głosowy czerwony, wewnętrzny","Zapytaj o cene przed zamówieniem","5A","A","Dostarczane bez baterii\n(Baterie do zamówienia FNM-BATTERIES; F.01U.168.622 )","EOL ogłoszony 21.08.2025. Dostępność do wyczerpania stanów magazynowych.",{"$f":"VLOOKUP(B241,'Fire EN 54'!$D$5:$I$508,6,0)","v":{"$error":"#N/A"}},"-","GB",{"$f":"VLOOKUP(B241,'Fire EN 54 FX 4,704'!$D$5:$L$500,9,0)","v":8531103000},{"$f":"VLOOKUP(B241,'Fire EN 54 FX 4,704'!$D$5:$O$500,12,0)","v":"0.222"}]
[null,"F.01U.268.724","FNM-420V-A-WH","Sygnalizator akustyczno-głosowy biały, wewnętrzny","Zapytaj o cene przed zamówieniem","5A","A","Dostarczane bez baterii\n(Baterie do zamówienia FNM-BATTERIES; F.01U.168.622 )","EOL ogłoszony 21.08.2025. Dostępność do wyczerpania stanów magazynowych.",{"$f":"VLOOKUP(B242,'Fire EN 54'!$D$5:$I$508,6,0)","v":{"$error":"#N/A"}},"-","GB",{"$f":"VLOOKUP(B242,'Fire EN 54 FX 4,704'!$D$5:$L$500,9,0)","v":8531103000},{"$f":"VLOOKUP(B242,'Fire EN 54 FX 4,704'!$D$5:$O$500,12,0)","v":"0.222"}]
[null,"F.01U.168.576","FNM-420U-A-BSRD","Adresowalny sygnalizator akustyczny z baterią w podstawie czujki, czerwony, wewnetrzny",{"$f":"VLOOKUP(B243,'Fire EN 54'!$D$5:$H$508,5,0)","v":{"v":780,"d":"780.00"}},"5A","A",null,null,{"$f":"VLOOKUP(B243,'Fire EN 54'!$D$5:$I$508,6,0)","v":"3"},"-","CN",{"$f":"VLOOKUP(B243,'Fire EN 54 FX 4,704'!$D$5:$L$500,9,0)","v":8531103000},{"$f":"VLOOKUP(B243,'Fire EN 54 FX 4,704'!$D$5:$O$500,12,0)","v":"0.215"}]
[null,"F.01U.168.575","FNM-420U-A-BSWH","Adresowalny sygnalizator akustyczny z baterią w podstawie czujki, biały, wewnetrzny",{"$f":"VLOOKUP(B244,'Fire EN 54'!$D$5:$H$508,5,0)","v":{"v":780,"d":"780.00"}},"5A","A",null,null,{"$f":"VLOOKUP(B244,'Fire EN 54'!$D$5:$I$508,6,0)","v":"3"},"-","CN",{"$f":"VLOOKUP(B244,'Fire EN 54 FX 4,704'!$D$5:$L$500,9,0)","v":8531103000},{"$f":"VLOOKUP(B244,'Fire EN 54 FX 4,704'!$D$5:$O$500,12,0)","v":"0.215"}]
[null,"F.01U.168.577","FNM-420U-A-RD","Adresowalny sygnalizator akustyczny z baterią, wewnętrzny, czerwony",{"$f":"VLOOKUP(B245,'Fire EN 54'!$D$5:$H$508,5,0)","v":{"v":819,"d":"819.00"}},"5A","A",null,null,{"$f":"VLOOKUP(B245,'Fire EN 54'!$D$5:$I$508,6,0)","v":"3"},"-","CN",{"$f":"VLOOKUP(B245,'Fire EN 54 FX 4,704'!$D$5:$L$500,9,0)","v":8531103000},{"$f":"VLOOKUP(B245,'Fire EN 54 FX 4,704'!$D$5:$O$500,12,0)","v":"0.245"}]
[null,"F.01U.168.578","FNM-420U-A-WH","Adresowalny sygnalizator akustyczny z baterią, wewnętrzny, biały",{"$f":"VLOOKUP(B246,'Fire EN 54'!$D$5:$H$508,5,0)","v":{"v":819,"d":"819.00"}},"5A","A",null,null,{"$f":"VLOOKUP(B246,'Fire EN 54'!$D$5:$I$508,6,0)","v":"3"},"-","CN",{"$f":"VLOOKUP(B246,'Fire EN 54 FX 4,704'!$D$5:$L$500,9,0)","v":8531103000},{"$f":"VLOOKUP(B246,'Fire EN 54 FX 4,704'!$D$5:$O$500,12,0)","v":"0.245"}]
[null,"F.01U.168.579","FNM-420U-B-RD","Adresowalny sygnalizator akustyczny z baterią, zewnętrzny, czerwony",{"$f":"VLOOKUP(B247,'Fire EN 54'!$D$5:$H$508,5,0)","v":{"v":902,"d":"902.00"}},"5A","A",null,null,{"$f":"VLOOKUP(B247,'Fire EN 54'!$D$5:$I$508,6,0)","v":"3"},"-","CN",{"$f":"VLOOKUP(B247,'Fire EN 54 FX 4,704'!$D$5:$L$500,9,0)","v":8531103000},{"$f":"VLOOKUP(B247,'Fire EN 54 FX 4,704'!$D$5:$O$500,12,0)","v":"0.325"}]
[null,"F.01U.168.622","FNM-BATTERIES","Baterie dla sygnalizatorów FNM-420U ",{"$f":"VLOOKUP(B248,'Fire EN 54'!$D$5:$H$508,5,0)","v":{"v":1637,"d":"1637.00"}},"5A","A","Minimalna ilość zamówienia 20 sztuk. Jeżeli potrzebujesz 40 sztuk zamawiasz 2 ",null,{"$f":"VLOOKUP(B248,'Fire EN 54'!$D$5:$I$508,6,0)","v":"3"},"-","GB",{"$f":"VLOOKUP(B248,'Fire EN 54 FX 4,704'!$D$5:$L$500,9,0)","v":8531103000},{"$f":"VLOOKUP(B248,'Fire EN 54 FX 4,704'!$D$5:$O$500,12,0)","v":"0.45"}]
[null,"F.01U.064.694","FNM-COVER-RD","Pokrywa do sygnalizatora akustycznego motowanego w podstawie do zastosowń wewnętrznych, czerwona",{"$f":"VLOOKUP(B249,'Fire EN 54'!$D$5:$H$508,5,0)","v":{"v":522,"d":"522.00"}},"5A","A","Minimalna ilość zamówienia 10 sztuk. Jeżeli potrzebujesz 30 sztuk zamawiasz 3 ",null,{"$f":"VLOOKUP(B249,'Fire EN 54'!$D$5:$I$508,6,0)","v":"3"},"-","GB",{"$f":"VLOOKUP(B249,'Fire EN 54 FX 4,704'!$D$5:$L$500,9,0)","v":8531103000},{"$f":"VLOOKUP(B249,'Fire EN 54 FX 4,704'!$D$5:$O$500,12,0)","v":"0.25"}]
[null,"F.01U.064.695","FNM-COVER-WH","Pokrywa do sygnalizatora akustycznego motowanego w podstawie do zastosowń wewnętrznych, biała ",{"$f":"VLOOKUP(B250,'Fire EN 54'!$D$5:$H$508,5,0)","v":{"v":522,"d":"522.00"}},"5A","A","Minimalna ilośc zamówienia 10 sztuk. Jeżeli potrzebujesz 30 sztuk zamawiasz 3 ",null,{"$f":"VLOOKUP(B250,'Fire EN 54'!$D$5:$I$508,6,0)","v":"3"},"-","GB",{"$f":"VLOOKUP(B250,'Fire EN 54 FX 4,704'!$D$5:$L$500,9,0)","v":8531103000},{"$f":"VLOOKUP(B250,'Fire EN 54 FX 4,704'!$D$5:$O$500,12,0)","v":"0.25"}]
[null,"F.01U.064.692","FNM-SPACER-WH","Podkładka dystansująca do natynkowej instalacji kabli biała",{"$f":"VLOOKUP(B251,'Fire EN 54'!$D$5:$H$508,5,0)","v":{"v":814,"d":"814.00"}},"5A","A","Minimalna ilośc zamówienia 10 sztuk. Jeżeli potrzebujesz 30 sztuk zamawiasz 3 ",null,{"$f":"VLOOKUP(B251,'Fire EN 54'!$D$5:$I$508,6,0)","v":"3"},"-","GB",{"$f":"VLOOKUP(B251,'Fire EN 54 FX 4,704'!$D$5:$L$500,9,0)","v":8531103000},{"$f":"VLOOKUP(B251,'Fire EN 54 FX 4,704'!$D$5:$O$500,12,0)","v":"0.49"}]
[null,"F.01U.064.693","FNM-SPACER-RD","Podkładka dystansująca do natynkowej instalacji kabli czerwona ",{"$f":"VLOOKUP(B252,'Fire EN 54'!$D$5:$H$508,5,0)","v":{"v":814,"d":"814.00"}},"5A","A","Minimalna ilośc zamówienia 10 sztuk. Jeżeli potrzebujesz 30 sztuk zamawiasz 3 ",null,{"$f":"VLOOKUP(B252,'Fire EN 54'!$D$5:$I$508,6,0)","v":"3"},"-","GB",{"$f":"VLOOKUP(B252,'Fire EN 54 FX 4,704'!$D$5:$L$500,9,0)","v":8531103000},{"$f":"VLOOKUP(B252,'Fire EN 54 FX 4,704'!$D$5:$O$500,12,0)","v":"0.49"}]
["Optyczne (konwencjonalne)"]
[null,"F.01U.143.883","FNS-320-SRD","Sygnalizator optyczny, czerwony",{"$f":"VLOOKUP(B254,'Fire EN 54'!$D$5:$H$508,5,0)","v":{"v":365,"d":"365.00"}},"5A","A",null,"Uwaga! Brak wymaganego Świadectwa Dopuszczenia.",{"$f":"VLOOKUP(B254,'Fire EN 54'!$D$5:$I$508,6,0)","v":"3"},"-","GB",{"$f":"VLOOKUP(B254,'Fire EN 54 FX 4,704'!$D$5:$L$500,9,0)","v":8531103000},{"$f":"VLOOKUP(B254,'Fire EN 54 FX 4,704'!$D$5:$O$500,12,0)","v":"0.216"}]
[null,"F.01U.143.885","FNS-320-SWH","Sygnalizator optyczny, biały",{"$f":"VLOOKUP(B255,'Fire EN 54'!$D$5:$H$508,5,0)","v":{"v":365,"d":"365.00"}},"5A","A",null,"Uwaga! Brak wymaganego Świadectwa Dopuszczenia.",{"$f":"VLOOKUP(B255,'Fire EN 54'!$D$5:$I$508,6,0)","v":"3"},"-","GB",{"$f":"VLOOKUP(B255,'Fire EN 54 FX 4,704'!$D$5:$L$500,9,0)","v":8531103000},{"$f":"VLOOKUP(B255,'Fire EN 54 FX 4,704'!$D$5:$O$500,12,0)","v":"0.291"}]
[null,"F.01U.288.465","SOL-LX-W-RF-R-S","Sygnalizator optyczny LX, sygnalizacja błyskowa w kolorze czerwonym, płytka podstawa w kolorze czerwonym, montaz ścienny",{"$f":"VLOOKUP(B256,'Fire EN 54'!$D$5:$H$508,5,0)","v":{"v":514,"d":"514.00"}},"5A","A",null,null,{"$f":"VLOOKUP(B256,'Fire EN 54'!$D$5:$I$508,6,0)","v":"3"},"-","GB",{"$f":"VLOOKUP(B256,'Fire EN 54 FX 4,704'!$D$5:$L$500,9,0)","v":8531103000},{"$f":"VLOOKUP(B256,'Fire EN 54 FX 4,704'!$D$5:$O$500,12,0)","v":"0.105"}]
[null,"F.01U.288.467","SOL-LX-W-RF-R-D","Sygnalizator optyczny LX, sygnalizacja błyskowa w kolorze czerwonym, głęboka podstawa w kolorze czerwonym, montaż ścienny",{"$f":"VLOOKUP(B257,'Fire EN 54'!$D$5:$H$508,5,0)","v":{"v":514,"d":"514.00"}},"5A","A",null,null,{"$f":"VLOOKUP(B257,'Fire EN 54'!$D$5:$I$508,6,0)","v":"3"},"-","GB",{"$f":"VLOOKUP(B257,'Fire EN 54 FX 4,704'!$D$5:$L$500,9,0)","v":8531103000},{"$f":"VLOOKUP(B257,'Fire EN 54 FX 4,704'!$D$5:$O$500,12,0)","v":"0.136"}]
[null,"F.01U.393.220","PY X-M-10-SSM R","Sygnalizator optyczny do zastosowań przemysłowych, czerwony",{"$f":"VLOOKUP(B258,'Fire EN 54'!$D$5:$H$508,5,0)","v":{"v":2442,"d":"2442.00"}},"5A","A",null,null,{"$f":"VLOOKUP(B258,'Fire EN 54'!$D$5:$I$508,6,0)","v":"3"},"-","DE",{"$f":"VLOOKUP(B258,'Fire EN 54 FX 4,704'!$D$5:$L$500,9,0)","v":85318070},{"$f":"VLOOKUP(B258,'Fire EN 54 FX 4,704'!$D$5:$O$500,12,0)","v":"0.440"}]
["Optyczne LSNi (adresowalne)"]
[null,"F.01U.516.089","FNS-420-R","Sygnalizator optyczny adresowalny instalowany w podstawie ",{"$f":"VLOOKUP(B260,'Fire EN 54'!$D$5:$H$508,5,0)","v":{"v":631,"d":"631.00"}},"5A","A",null,"Uwaga! Brak wymaganego Świadectwa Dopuszczenia.",{"$f":"VLOOKUP(B260,'Fire EN 54'!$D$5:$I$508,6,0)","v":"3"},"-","CN",{"$f":"VLOOKUP(B260,'Fire EN 54 FX 4,704'!$D$5:$L$500,9,0)","v":8531900000},{"$f":"VLOOKUP(B260,'Fire EN 54 FX 4,704'!$D$5:$O$500,12,0)","v":"0.077"}]
["Sprzęt testowy i serwisowy"]
[null,"F.01U.508.720","FAA-500-RTL","Urządzenie do wyjmowania czujek serii 500 z gniazda",{"$f":"VLOOKUP(B262,'Fire EN 54'!$D$5:$H$508,5,0)","v":{"v":5246,"d":"5246.00"}},"5A","A",null,null,{"$f":"VLOOKUP(B262,'Fire EN 54'!$D$5:$I$508,6,0)","v":"3"},"-","GB",{"$f":"VLOOKUP(B262,'Fire EN 54 FX 4,704'!$D$5:$L$500,9,0)","v":8205598000},{"$f":"VLOOKUP(B262,'Fire EN 54 FX 4,704'!$D$5:$O$500,12,0)","v":"0.785"}]
[null,"F.01U.363.162","SOLO461","Tester czujek termicznych, bez kabla",{"$f":"VLOOKUP(B263,'Fire EN 54'!$D$5:$H$508,5,0)","v":{"v":9331,"d":"9331.00"}},"5A","A",null,null,{"$f":"VLOOKUP(B263,'Fire EN 54'!$D$5:$I$508,6,0)","v":"3"},"-","GB",{"$f":"VLOOKUP(B263,'Fire EN 54 FX 4,704'!$D$5:$L$500,9,0)","v":3926909790},{"$f":"VLOOKUP(B263,'Fire EN 54 FX 4,704'!$D$5:$O$500,12,0)","v":"2.35"}]
[null,"F.01U.363.163","SOLO770","Zapasowa bateria do SOLO461",{"$f":"VLOOKUP(B264,'Fire EN 54'!$D$5:$H$508,5,0)","v":{"v":1897,"d":"1897.00"}},"5A","A",null,null,{"$f":"VLOOKUP(B264,'Fire EN 54'!$D$5:$I$508,6,0)","v":"3"},"-","GB",{"$f":"VLOOKUP(B264,'Fire EN 54 FX 4,704'!$D$5:$L$500,9,0)","v":3926909790},{"$f":"VLOOKUP(B264,'Fire EN 54 FX 4,704'!$D$5:$O$500,12,0)","v":"0.466"}]
[null,"4.998.112.071","SOLO330","Tester czujek optycznych",{"$f":"VLOOKUP(B265,'Fire EN 54'!$D$5:$H$508,5,0)","v":{"v":2620,"d":"2620.00"}},"5A","A",null,null,{"$f":"VLOOKUP(B265,'Fire EN 54'!$D$5:$I$508,6,0)","v":"3"},"-","GB",{"$f":"VLOOKUP(B265,'Fire EN 54 FX 4,704'!$D$5:$L$500,9,0)","v":3926909790},{"$f":"VLOOKUP(B265,'Fire EN 54 FX 4,704'!$D$5:$O$500,12,0)","v":"0.73"}]
[null,"F.01U.345.557","FME-SOLO-A10S","Aerosol do testowania czujek optycznych",{"$f":"VLOOKUP(B266,'Fire EN 54'!$D$5:$H$508,5,0)","v":{"v":359,"d":"359.00"}},"5A","A","Minimalne zamówienie paczka 12szt lub wieloktotność 12. Jeżli potrzebujesz 12 sztuk zamawiasz 12",null,{"$f":"VLOOKUP(B266,'Fire EN 54'!$D$5:$I$508,6,0)","v":"3"},"-","GB",{"$f":"VLOOKUP(B266,'Fire EN 54 FX 4,704'!$D$5:$L$500,9,0)","v":4911990000},{"$f":"VLOOKUP(B266,'Fire EN 54 FX 4,704'!$D$5:$O$500,12,0)","v":"0.24"}]
[null,"F.01U.301.469","FME-Test-CO","Aerozol z tlenkiem węgla do testowania czujek z gazowym torem detekcji",{"$f":"VLOOKUP(B267,'Fire EN 54'!$D$5:$H$508,5,0)","v":{"v":385,"d":"385.00"}},"5A","A",null,null,{"$f":"VLOOKUP(B267,'Fire EN 54'!$D$5:$I$508,6,0)","v":"3"},"-","GB",{"$f":"VLOOKUP(B267,'Fire EN 54 FX 4,704'!$D$5:$L$500,9,0)","v":3824840000},{"$f":"VLOOKUP(B267,'Fire EN 54 FX 4,704'!$D$5:$O$500,12,0)","v":"0.05"}]
[null,"4.998.112.113","SOLO200","Narzędzie do demontowania czujek (bez tyczki)",{"$f":"VLOOKUP(B268,'Fire EN 54'!$D$5:$H$508,5,0)","v":{"v":3495,"d":"3495.00"}},"5A","A",null,null,{"$f":"VLOOKUP(B268,'Fire EN 54'!$D$5:$I$508,6,0)","v":"3"},"-","GB",{"$f":"VLOOKUP(B268,'Fire EN 54 FX 4,704'!$D$5:$L$500,9,0)","v":8205598000},{"$f":"VLOOKUP(B268,'Fire EN 54 FX 4,704'!$D$5:$O$500,12,0)","v":"1.221"}]
[null,"4.998.112.069","SOLO106-2","Tyczka przedłużająca do narzędzia do demontowania czujek 1-3,38 m",{"$f":"VLOOKUP(B269,'Fire EN 54'!$D$5:$H$508,5,0)","v":{"v":6413,"d":"6413.00"}},"5A","A",null,null,{"$f":"VLOOKUP(B269,'Fire EN 54'!$D$5:$I$508,6,0)","v":"3"},"-","GB",{"$f":"VLOOKUP(B269,'Fire EN 54 FX 4,704'!$D$5:$L$500,9,0)","v":3926909790},{"$f":"VLOOKUP(B269,'Fire EN 54 FX 4,704'!$D$5:$O$500,12,0)","v":"1.04"}]
[null,"4.998.112.070","SOLO101","Tyczka przedłużająca (1m)",{"$f":"VLOOKUP(B270,'Fire EN 54'!$D$5:$H$508,5,0)","v":{"v":1336,"d":"1336.00"}},"5A","A",null,null,{"$f":"VLOOKUP(B270,'Fire EN 54'!$D$5:$I$508,6,0)","v":"3"},"-","GB",{"$f":"VLOOKUP(B270,'Fire EN 54 FX 4,704'!$D$5:$L$500,9,0)","v":3926909790},{"$f":"VLOOKUP(B270,'Fire EN 54 FX 4,704'!$D$5:$O$500,12,0)","v":"0.38"}]
[null,"4.998.112.073","SOLO610","Torba na wyposażenie Solo ",{"$f":"VLOOKUP(B271,'Fire EN 54'!$D$5:$H$508,5,0)","v":{"v":1745,"d":"1745.00"}},"5A","A",null,null,{"$f":"VLOOKUP(B271,'Fire EN 54'!$D$5:$I$508,6,0)","v":"3"},"-","GB",{"$f":"VLOOKUP(B271,'Fire EN 54 FX 4,704'!$D$5:$L$500,9,0)","v":4202929890},{"$f":"VLOOKUP(B271,'Fire EN 54 FX 4,704'!$D$5:$O$500,12,0)","v":"2.52"}]
[null,"4.998.082.502","RTL-cap","Plastikowa pokrywa do narzędzia do demontowania czujek (niebędne dwie sztuki)",{"$f":"VLOOKUP(B272,'Fire EN 54'!$D$5:$H$508,5,0)","v":{"v":152,"d":"152.00"}},"5A","A",null,null,{"$f":"VLOOKUP(B272,'Fire EN 54'!$D$5:$I$508,6,0)","v":"3"},"-","GB",{"$f":"VLOOKUP(B272,'Fire EN 54 FX 4,704'!$D$5:$L$500,9,0)","v":3926909790},{"$f":"VLOOKUP(B272,'Fire EN 54 FX 4,704'!$D$5:$O$500,12,0)","v":"0.083"}]
[null,"F.01U.169.803","FME-420-LSN-TTL","Walizka diagnostyczna LSNi ",{"$f":"VLOOKUP(B273,'Fire EN 54'!$D$5:$H$508,5,0)","v":{"v":23961,"d":"23961.00"}},"5A","A",null,null,{"$f":"VLOOKUP(B273,'Fire EN 54'!$D$5:$I$508,6,0)","v":"3"},"-","GB",{"$f":"VLOOKUP(B273,'Fire EN 54 FX 4,704'!$D$5:$L$500,9,0)","v":90303900},{"$f":"VLOOKUP(B273,'Fire EN 54 FX 4,704'!$D$5:$O$500,12,0)","v":"5.092"}]
["Wizualizacja"]
["System wizualizacji"]
[null,"F.01U.374.278","FSM-10k","System wizualizacji do 10 000 punktów.",{"$f":"VLOOKUP(B276,'Fire EN 54'!$D$5:$H$508,5,0)","v":{"v":45324,"d":"45324.00"}},"5A","C",null,null,{"$f":"VLOOKUP(B276,'Fire EN 54'!$D$5:$I$508,6,0)","v":"n.a."},"-","IT",{"$f":"VLOOKUP(B276,'Fire EN 54 FX 4,704'!$D$5:$L$500,9,0)","v":4911990000},{"$f":"VLOOKUP(B276,'Fire EN 54 FX 4,704'!$D$5:$O$500,12,0)","v":"0.001"}]
[null,"F.01U.374.695","FSM-5000","System wizualizacji do 5000 punktów.",{"$f":"VLOOKUP(B277,'Fire EN 54'!$D$5:$H$508,5,0)","v":{"v":25070,"d":"25070.00"}},"5A","C",null,null,{"$f":"VLOOKUP(B277,'Fire EN 54'!$D$5:$I$508,6,0)","v":"n.a."},"-","IT",{"$f":"VLOOKUP(B277,'Fire EN 54 FX 4,704'!$D$5:$L$500,9,0)","v":4911990000},{"$f":"VLOOKUP(B277,'Fire EN 54 FX 4,704'!$D$5:$O$500,12,0)","v":"0.001"}]
[null,"F.01U.374.694","FSM-2500","System wizualizacji do 2500 punktów.",{"$f":"VLOOKUP(B278,'Fire EN 54'!$D$5:$H$508,5,0)","v":{"v":16996,"d":"16996.00"}},"5A","C",null,null,{"$f":"VLOOKUP(B278,'Fire EN 54'!$D$5:$I$508,6,0)","v":"n.a."},"-","IT",{"$f":"VLOOKUP(B278,'Fire EN 54 FX 4,704'!$D$5:$L$500,9,0)","v":4911990000},{"$f":"VLOOKUP(B278,'Fire EN 54 FX 4,704'!$D$5:$O$500,12,0)","v":"0.001"}]
["Systemy ASD - TITANUS"]
["Titanus LSNi (adresowalny)"]
[null,"F.01U.078.495","FAS-420-TM","Zasysająca czujka dymu z panelem wskaźników LED, sygnalizujących tryb pracy, usterkę i alarm",{"$f":"VLOOKUP(B281,'Fire EN 54'!$D$5:$H$508,5,0)","v":{"v":8331,"d":"8331.00"}},"5A","A",null,null,{"$f":"VLOOKUP(B281,'Fire EN 54'!$D$5:$I$508,6,0)","v":"3"},"-","DE",{"$f":"VLOOKUP(B281,'Fire EN 54 FX 4,704'!$D$5:$L$500,9,0)","v":8536501999},{"$f":"VLOOKUP(B281,'Fire EN 54 FX 4,704'!$D$5:$O$500,12,0)","v":"0.576"}]
[null,"F.01U.078.496","FAS-420-TM-R","Zasysająca czujka dymu  z panelem wskaźników LED, sygnalizujących tryb pray, usterkę, alarm zidentyfikacją źródła ognia",{"$f":"VLOOKUP(B282,'Fire EN 54'!$D$5:$H$508,5,0)","v":{"v":10712,"d":"10712.00"}},"5A","A",null,null,{"$f":"VLOOKUP(B282,'Fire EN 54'!$D$5:$I$508,6,0)","v":"3"},"-","DE",{"$f":"VLOOKUP(B282,'Fire EN 54 FX 4,704'!$D$5:$L$500,9,0)","v":8536501999},{"$f":"VLOOKUP(B282,'Fire EN 54 FX 4,704'!$D$5:$O$500,12,0)","v":"0.47"}]
[null,"F.01U.078.497","FAS-420-TM-RVB","Zasysająca czujka dymu z panelem wskaźników LED, sygnalizujących tryb pracy,usterkę, alarm, z identyfikacjąźródła ognia oraz wskaźnikiem poziomu zadymienia",{"$f":"VLOOKUP(B283,'Fire EN 54'!$D$5:$H$508,5,0)","v":{"v":13093,"d":"13093.00"}},"5A","A",null,null,{"$f":"VLOOKUP(B283,'Fire EN 54'!$D$5:$I$508,6,0)","v":"3"},"-","DE",{"$f":"VLOOKUP(B283,'Fire EN 54 FX 4,704'!$D$5:$L$500,9,0)","v":8536501999},{"$f":"VLOOKUP(B283,'Fire EN 54 FX 4,704'!$D$5:$O$500,12,0)","v":"0.47"}]
[null,"F.01U.078.494","FAS-420-TM-HB","Podstawa obudowy do zasysającej czujki dymu serii FAS-420-TM",{"$f":"VLOOKUP(B284,'Fire EN 54'!$D$5:$H$508,5,0)","v":{"v":950,"d":"950.00"}},"5A","A",null,null,{"$f":"VLOOKUP(B284,'Fire EN 54'!$D$5:$I$508,6,0)","v":"3"},"-","DE",{"$f":"VLOOKUP(B284,'Fire EN 54 FX 4,704'!$D$5:$L$500,9,0)","v":8536909599},{"$f":"VLOOKUP(B284,'Fire EN 54 FX 4,704'!$D$5:$O$500,12,0)","v":"0.468"}]
[null,"F.01U.029.255","FAS-420-TP1","Titanus PRO SENS TP-1, LSNi",{"$f":"VLOOKUP(B285,'Fire EN 54'!$D$5:$H$508,5,0)","v":{"v":10662,"d":"10662.00"}},"5A","A",null,null,{"$f":"VLOOKUP(B285,'Fire EN 54'!$D$5:$I$508,6,0)","v":"3"},"-","DE",{"$f":"VLOOKUP(B285,'Fire EN 54 FX 4,704'!$D$5:$L$500,9,0)","v":8536501999},{"$f":"VLOOKUP(B285,'Fire EN 54 FX 4,704'!$D$5:$O$500,12,0)","v":"1.53"}]
[null,"F.01U.029.256","FAS-420-TP2","Titanus PRO SENS TP-2, LSNi",{"$f":"VLOOKUP(B286,'Fire EN 54'!$D$5:$H$508,5,0)","v":{"v":10662,"d":"10662.00"}},"5A","A",null,null,{"$f":"VLOOKUP(B286,'Fire EN 54'!$D$5:$I$508,6,0)","v":"3"},"-","DE",{"$f":"VLOOKUP(B286,'Fire EN 54 FX 4,704'!$D$5:$L$500,9,0)","v":8536501999},{"$f":"VLOOKUP(B286,'Fire EN 54 FX 4,704'!$D$5:$O$500,12,0)","v":"1.45"}]
[null,"F.01U.029.252","FAS-420-TT1","Titanus TOP SENS TT-1, LSNi",{"$f":"VLOOKUP(B287,'Fire EN 54'!$D$5:$H$508,5,0)","v":{"v":23657,"d":"23657.00"}},"5A","A",null,null,{"$f":"VLOOKUP(B287,'Fire EN 54'!$D$5:$I$508,6,0)","v":"3"},"-","DE",{"$f":"VLOOKUP(B287,'Fire EN 54 FX 4,704'!$D$5:$L$500,9,0)","v":8536501999},{"$f":"VLOOKUP(B287,'Fire EN 54 FX 4,704'!$D$5:$O$500,12,0)","v":"1.341"}]
[null,"F.01U.029.253","FAS-420-TT2","Titanus TOP SENS TT-2, LSNi",{"$f":"VLOOKUP(B288,'Fire EN 54'!$D$5:$H$508,5,0)","v":{"v":23657,"d":"23657.00"}},"5A","A",null,null,{"$f":"VLOOKUP(B288,'Fire EN 54'!$D$5:$I$508,6,0)","v":"3"},"-","DE",{"$f":"VLOOKUP(B288,'Fire EN 54 FX 4,704'!$D$5:$L$500,9,0)","v":8536501999},{"$f":"VLOOKUP(B288,'Fire EN 54 FX 4,704'!$D$5:$O$500,12,0)","v":"1.45"}]
[null,"F.01U.083.877","FAS-420-TP1-SL","Titanus Pro Sens podstawowy TP1, wyciszona zasysająca czujka dymu wwersji „LSN improved”",{"$f":"VLOOKUP(B289,'Fire EN 54'!$D$5:$H$508,5,0)","v":{"v":11343,"d":"11343.00"}},"5A",1,null,null,{"$f":"VLOOKUP(B289,'Fire EN 54'!$D$5:$I$508,6,0)","v":"3"},"-","DE",{"$f":"VLOOKUP(B289,'Fire EN 54 FX 4,704'!$D$5:$L$500,9,0)","v":8536501999},{"$f":"VLOOKUP(B289,'Fire EN 54 FX 4,704'!$D$5:$O$500,12,0)","v":"1.45"}]
[null,"F.01U.083.876","FAS-420-TP2-SL","Titanus Pro Sens Podstawowa TP2 ,wyciszona zasysająca czujka dymu wwersji „LSN improved”",{"$f":"VLOOKUP(B290,'Fire EN 54'!$D$5:$H$508,5,0)","v":{"v":11343,"d":"11343.00"}},"5A","A",null,null,{"$f":"VLOOKUP(B290,'Fire EN 54'!$D$5:$I$508,6,0)","v":"3"},"-","DE",{"$f":"VLOOKUP(B290,'Fire EN 54 FX 4,704'!$D$5:$L$500,9,0)","v":8536501999},{"$f":"VLOOKUP(B290,'Fire EN 54 FX 4,704'!$D$5:$O$500,12,0)","v":"1.55"}]
[null,"F.01U.083.875","FAS-420-TT1-SL","Titanus Top Sens podstawowy TT1 , wyciszona zasysająca czujka dymu wwersji „LSN improved”",{"$f":"VLOOKUP(B291,'Fire EN 54'!$D$5:$H$508,5,0)","v":{"v":25999,"d":"25999.00"}},"5A","A",null,null,{"$f":"VLOOKUP(B291,'Fire EN 54'!$D$5:$I$508,6,0)","v":"3"},"-","DE",{"$f":"VLOOKUP(B291,'Fire EN 54 FX 4,704'!$D$5:$L$500,9,0)","v":8531900000},{"$f":"VLOOKUP(B291,'Fire EN 54 FX 4,704'!$D$5:$O$500,12,0)","v":"1.45"}]
[null,"F.01U.083.874","FAS-420-TT2-SL","Titanus Top Sens podstawowa  TT2,wyciszona zasysająca czujka dymu wwersji „LSN improved”",{"$f":"VLOOKUP(B292,'Fire EN 54'!$D$5:$H$508,5,0)","v":{"v":25999,"d":"25999.00"}},"5A","A",null,null,{"$f":"VLOOKUP(B292,'Fire EN 54'!$D$5:$I$508,6,0)","v":"3"},"-","DE",{"$f":"VLOOKUP(B292,'Fire EN 54 FX 4,704'!$D$5:$L$500,9,0)","v":8536501999},{"$f":"VLOOKUP(B292,'Fire EN 54 FX 4,704'!$D$5:$O$500,12,0)","v":"1.57"}]
[null,"F.01U.090.252","FAS-ASD-SL","Element wyciszający system zasysnia",{"$f":"VLOOKUP(B293,'Fire EN 54'!$D$5:$H$508,5,0)","v":{"v":1189,"d":"1189.00"}},"5A","A",null,null,{"$f":"VLOOKUP(B293,'Fire EN 54'!$D$5:$I$508,6,0)","v":"3"},"-","DE",{"$f":"VLOOKUP(B293,'Fire EN 54 FX 4,704'!$D$5:$L$500,9,0)","v":3926909790},{"$f":"VLOOKUP(B293,'Fire EN 54 FX 4,704'!$D$5:$O$500,12,0)","v":"0.43"}]
[null,"4.998.143.400","DM-TT-50(80)","Moduł czujki DM-TT-50(80)-LB/a",{"$f":"VLOOKUP(B294,'Fire EN 54'!$D$5:$H$508,5,0)","v":{"v":2977,"d":"2977.00"}},"5A","A",null,null,{"$f":"VLOOKUP(B294,'Fire EN 54'!$D$5:$I$508,6,0)","v":"3"},"-","DE",{"$f":"VLOOKUP(B294,'Fire EN 54 FX 4,704'!$D$5:$L$500,9,0)","v":8531900000},{"$f":"VLOOKUP(B294,'Fire EN 54 FX 4,704'!$D$5:$O$500,12,0)","v":"0.1"}]
[null,"4.998.143.401","DM-TT-10(25)","Moduł czujki DM-TT-10(25)-LB/a",{"$f":"VLOOKUP(B295,'Fire EN 54'!$D$5:$H$508,5,0)","v":{"v":4828,"d":"4828.00"}},"5A",1,null,null,{"$f":"VLOOKUP(B295,'Fire EN 54'!$D$5:$I$508,6,0)","v":"3"},"-","DE",{"$f":"VLOOKUP(B294,'Fire EN 54 FX 4,704'!$D$5:$L$500,9,0)","v":8531900000},{"$f":"VLOOKUP(B295,'Fire EN 54 FX 4,704'!$D$5:$O$500,12,0)","v":{"$error":"#N/A"}}]
[null,"4.998.143.402","DM-TT-01(05)","Moduł czujki DM-TT-01(05)-LB/a",{"$f":"VLOOKUP(B296,'Fire EN 54'!$D$5:$H$508,5,0)","v":{"v":12975,"d":"12975.00"}},"5A",1,null,null,{"$f":"VLOOKUP(B296,'Fire EN 54'!$D$5:$I$508,6,0)","v":"3"},"-","DE",{"$f":"VLOOKUP(B296,'Fire EN 54 FX 4,704'!$D$5:$L$500,9,0)","v":8531900000},{"$f":"VLOOKUP(B296,'Fire EN 54 FX 4,704'!$D$5:$O$500,12,0)","v":"0.125"}]
["Titanus konwencjonalny"]
[null,"F.01U.141.195","FCS-320-TM","FCS-320-TM - Titanus MicroSense konwencjonalny",{"$f":"VLOOKUP(B298,'Fire EN 54'!$D$5:$H$508,5,0)","v":{"v":7531,"d":"7531.00"}},"5A","A",null,"Tak jak w przypadku FAS-420-TM, wymagana podstawa FAS-420-TM-HB",{"$f":"VLOOKUP(B298,'Fire EN 54'!$D$5:$I$508,6,0)","v":"3"},"-","DE",{"$f":"VLOOKUP(B298,'Fire EN 54 FX 4,704'!$D$5:$L$500,9,0)","v":8536501999},{"$f":"VLOOKUP(B298,'Fire EN 54 FX 4,704'!$D$5:$O$500,12,0)","v":"0.53"}]
[null,"F.01U.141.196","FCS-320-TM-R","FCS-320-TM-R - Titanus MicroSense konwencjonalny z identyfikacją źródła pożarów (wymagany moduł FCA-320-RELAY i obudowa FCS-320-IK).",{"$f":"VLOOKUP(B299,'Fire EN 54'!$D$5:$H$508,5,0)","v":{"v":9912,"d":"9912.00"}},"5A","C",null,"Tak jak w przypadku FAS-420-TM-R, wymagana podstawa FAS-420-TM-HB",{"$f":"VLOOKUP(B299,'Fire EN 54'!$D$5:$I$508,6,0)","v":"3"},"-","DE",{"$f":"VLOOKUP(B299,'Fire EN 54 FX 4,704'!$D$5:$L$500,9,0)","v":8536501999},{"$f":"VLOOKUP(B299,'Fire EN 54 FX 4,704'!$D$5:$O$500,12,0)","v":"0.47"}]
[null,"F.01U.141.197","FCS-320-TP1","FCS-320-TP1 - Titanus ProSense TP1 konwencjonalny",{"$f":"VLOOKUP(B300,'Fire EN 54'!$D$5:$H$508,5,0)","v":{"v":9856,"d":"9856.00"}},"5A","A",null,null,{"$f":"VLOOKUP(B300,'Fire EN 54'!$D$5:$I$508,6,0)","v":"3"},"-","DE",{"$f":"VLOOKUP(B300,'Fire EN 54 FX 4,704'!$D$5:$L$500,9,0)","v":8536501999},{"$f":"VLOOKUP(B300,'Fire EN 54 FX 4,704'!$D$5:$O$500,12,0)","v":"1.282"}]
[null,"F.01U.141.198","FCS-320-TP2","FCS-320-TP2 - Titanus ProSense TP2 konwencjonalny",{"$f":"VLOOKUP(B301,'Fire EN 54'!$D$5:$H$508,5,0)","v":{"v":9856,"d":"9856.00"}},"5A","A",null,null,{"$f":"VLOOKUP(B301,'Fire EN 54'!$D$5:$I$508,6,0)","v":"3"},"-","DE",{"$f":"VLOOKUP(B301,'Fire EN 54 FX 4,704'!$D$5:$L$500,9,0)","v":8536501999},{"$f":"VLOOKUP(B301,'Fire EN 54 FX 4,704'!$D$5:$O$500,12,0)","v":"1.324"}]
[null,"F.01U.141.199","FCA-320-RESET","Opcjonalna płytka resetu dla czujek serii FCS-320",{"$f":"VLOOKUP(B302,'Fire EN 54'!$D$5:$H$508,5,0)","v":{"v":944,"d":"944.00"}},"5A","A",null,null,{"$f":"VLOOKUP(B302,'Fire EN 54'!$D$5:$I$508,6,0)","v":"3"},"-","DE",{"$f":"VLOOKUP(B302,'Fire EN 54 FX 4,704'!$D$5:$L$500,9,0)","v":8531900000},{"$f":"VLOOKUP(B302,'Fire EN 54 FX 4,704'!$D$5:$O$500,12,0)","v":"0.02"}]
[null,"F.01U.141.200","FCA-320-RELAY","Opcjonalny moduł wyjść przekaźnikowych typu RU-1 do FCS-320-TM-R",{"$f":"VLOOKUP(B303,'Fire EN 54'!$D$5:$H$508,5,0)","v":{"v":1775,"d":"1775.00"}},"5A","C",null,null,{"$f":"VLOOKUP(B303,'Fire EN 54'!$D$5:$I$508,6,0)","v":"3"},"-","DE",{"$f":"VLOOKUP(B303,'Fire EN 54 FX 4,704'!$D$5:$L$500,9,0)","v":8536490099},{"$f":"VLOOKUP(B303,'Fire EN 54 FX 4,704'!$D$5:$O$500,12,0)","v":"0.1"}]
[null,"F.01U.141.201","FCS-320-IK","Zestaw montażowy do dodatkowych modułów (reset, relay)",{"$f":"VLOOKUP(B304,'Fire EN 54'!$D$5:$H$508,5,0)","v":{"v":219,"d":"219.00"}},"5A","C",null,null,{"$f":"VLOOKUP(B304,'Fire EN 54'!$D$5:$I$508,6,0)","v":"3"},"-","DE",{"$f":"VLOOKUP(B304,'Fire EN 54 FX 4,704'!$D$5:$L$500,9,0)","v":7326909890},{"$f":"VLOOKUP(B304,'Fire EN 54 FX 4,704'!$D$5:$O$500,12,0)","v":"0.033"}]
[null,"4.998.143.394","DM-TP-50(80)","Moduł detektora DM-TP-50(80)-LB/a NIEKOMPATYBILNY Z FAS-420 TP/TT",{"$f":"VLOOKUP(B305,'Fire EN 54'!$D$5:$H$508,5,0)","v":{"v":2957,"d":"2957.00"}},"5A","A",null,null,{"$f":"VLOOKUP(B305,'Fire EN 54'!$D$5:$I$508,6,0)","v":"3"},"-","DE",{"$f":"VLOOKUP(B305,'Fire EN 54 FX 4,704'!$D$5:$L$500,9,0)","v":8531900000},{"$f":"VLOOKUP(B305,'Fire EN 54 FX 4,704'!$D$5:$O$500,12,0)","v":"0.11"}]
[null,"4.998.143.395","DM-TP-10(25)","Moduł detektora DM-TP-10(25)-LB/a NIEKOMPATYBILNY Z FAS-420 TP/TT",{"$f":"VLOOKUP(B306,'Fire EN 54'!$D$5:$H$508,5,0)","v":{"v":4828,"d":"4828.00"}},"5A","A",null,null,{"$f":"VLOOKUP(B306,'Fire EN 54'!$D$5:$I$508,6,0)","v":"3"},"-","DE",{"$f":"VLOOKUP(B306,'Fire EN 54 FX 4,704'!$D$5:$L$500,9,0)","v":8531900000},{"$f":"VLOOKUP(B306,'Fire EN 54 FX 4,704'!$D$5:$O$500,12,0)","v":"0.116"}]
[null,"4.998.143.396","DM-TP-01(05)","Moduł detektora DM-TP-01(05)-LB/a NIEKOMPATYBILNY Z FAS-420 TP/TT",{"$f":"VLOOKUP(B307,'Fire EN 54'!$D$5:$H$508,5,0)","v":{"v":12955,"d":"12955.00"}},"5A","A",null,null,{"$f":"VLOOKUP(B307,'Fire EN 54'!$D$5:$I$508,6,0)","v":"3"},"-","DE",{"$f":"VLOOKUP(B307,'Fire EN 54 FX 4,704'!$D$5:$L$500,9,0)","v":8531900000},{"$f":"VLOOKUP(B307,'Fire EN 54 FX 4,704'!$D$5:$O$500,12,0)","v":"0.1"}]
["Akcesoria Titanus"]
[null,"4.998.143.410","TITANUS MT-1 mount","Wspornik montażowy MT-1",{"$f":"VLOOKUP(B309,'Fire EN 54'!$D$5:$H$508,5,0)","v":{"v":569,"d":"569.00"}},"5A","A",null,null,{"$f":"VLOOKUP(B309,'Fire EN 54'!$D$5:$I$508,6,0)","v":"3"},"-","DE",{"$f":"VLOOKUP(B309,'Fire EN 54 FX 4,704'!$D$5:$L$500,9,0)","v":7326909890},{"$f":"VLOOKUP(B309,'Fire EN 54 FX 4,704'!$D$5:$O$500,12,0)","v":"0.971"}]
[null,"4.998.143.413","TITANUS AF-BR","Taśmy znakujące  AF-BR do kryz redukcji zasysania",{"$f":"VLOOKUP(B310,'Fire EN 54'!$D$5:$H$508,5,0)","v":{"v":10,"d":"10.00"}},"5A","A",null,null,{"$f":"VLOOKUP(B310,'Fire EN 54'!$D$5:$I$508,6,0)","v":"3"},"-","DE",{"$f":"VLOOKUP(B310,'Fire EN 54 FX 4,704'!$D$5:$L$500,9,0)","v":3926909790},{"$f":"VLOOKUP(B310,'Fire EN 54 FX 4,704'!$D$5:$O$500,12,0)","v":"0.001"}]
[null,"4.998.143.416","TITANUS AF-2.0","Folia redukcyjna 2,0mm (cena za 1szt) ",{"$f":"VLOOKUP(B311,'Fire EN 54'!$D$5:$H$508,5,0)","v":{"v":10,"d":"10.00"}},"5A","A","Minimalne zamówienie paczka 10 sztuk lub wielokrotność 10. Jeżeli potrzebujesz 30 sztuk zamawiasz 30 ",null,{"$f":"VLOOKUP(B311,'Fire EN 54'!$D$5:$I$508,6,0)","v":"3"},"-","DE",{"$f":"VLOOKUP(B311,'Fire EN 54 FX 4,704'!$D$5:$L$500,9,0)","v":3926909790},{"$f":"VLOOKUP(B311,'Fire EN 54 FX 4,704'!$D$5:$O$500,12,0)","v":"0.017"}]
[null,"4.998.143.417","TITANUS AF-2.5","Folia redukcyjna 2,5mm (cena za 1szt)",{"$f":"VLOOKUP(B312,'Fire EN 54'!$D$5:$H$508,5,0)","v":{"v":10,"d":"10.00"}},"5A","A","Minimalne zamówienie paczka 10 sztuk lub wielokrotność 10. Jeżeli potrzebujesz 30 sztuk zamawiasz 30 ",null,{"$f":"VLOOKUP(B312,'Fire EN 54'!$D$5:$I$508,6,0)","v":"3"},"-","DE",{"$f":"VLOOKUP(B312,'Fire EN 54 FX 4,704'!$D$5:$L$500,9,0)","v":3926909790},{"$f":"VLOOKUP(B312,'Fire EN 54 FX 4,704'!$D$5:$O$500,12,0)","v":"0.009"}]
[null,"4.998.143.418","TITANUS AF-3.0","Folia redukcyjna 3,0mm (cena za 1szt)",{"$f":"VLOOKUP(B313,'Fire EN 54'!$D$5:$H$508,5,0)","v":{"v":10,"d":"10.00"}},"5A","A","Minimalne zamówienie paczka 10 sztuk lub wielokrotność 10. Jeżeli potrzebujesz 30 sztuk zamawiasz 30 ",null,{"$f":"VLOOKUP(B313,'Fire EN 54'!$D$5:$I$508,6,0)","v":"3"},"-","DE",{"$f":"VLOOKUP(B313,'Fire EN 54 FX 4,704'!$D$5:$L$500,9,0)","v":3926909790},{"$f":"VLOOKUP(B313,'Fire EN 54 FX 4,704'!$D$5:$O$500,12,0)","v":"0.001"}]
[null,"4.998.143.419","TITANUS AF-3.2","Folia redukcyjna 3,2mm (cena za 1szt) ",{"$f":"VLOOKUP(B314,'Fire EN 54'!$D$5:$H$508,5,0)","v":{"v":10,"d":"10.00"}},"5A","A","Minimalne zamówienie paczka 10 sztuk lub wielokrotność 10. Jeżeli potrzebujesz 30 sztuk zamawiasz 30 ",null,{"$f":"VLOOKUP(B314,'Fire EN 54'!$D$5:$I$508,6,0)","v":"3"},"-","DE",{"$f":"VLOOKUP(B314,'Fire EN 54 FX 4,704'!$D$5:$L$500,9,0)","v":3926909790},{"$f":"VLOOKUP(B314,'Fire EN 54 FX 4,704'!$D$5:$O$500,12,0)","v":"0.012"}]
[null,"4.998.143.420","TITANUS AF-3.4","Folia redukcyjna 3,4mm (cena za 1szt)",{"$f":"VLOOKUP(B315,'Fire EN 54'!$D$5:$H$508,5,0)","v":{"v":10,"d":"10.00"}},"5A","A","Minimalne zamówienie paczka 10 sztuk lub wielokrotność 10. Jeżeli potrzebujesz 30 sztuk zamawiasz 30 ",null,{"$f":"VLOOKUP(B315,'Fire EN 54'!$D$5:$I$508,6,0)","v":"3"},"-","DE",{"$f":"VLOOKUP(B315,'Fire EN 54 FX 4,704'!$D$5:$L$500,9,0)","v":3926909790},{"$f":"VLOOKUP(B315,'Fire EN 54 FX 4,704'!$D$5:$O$500,12,0)","v":"0.116"}]
[null,"4.998.143.422","TITANUS AF-3.6","Folia redukcyjna 3,6mm (cena za 1szt)",{"$f":"VLOOKUP(B316,'Fire EN 54'!$D$5:$H$508,5,0)","v":{"v":10,"d":"10.00"}},"5A","A","Minimalne zamówienie paczka 10 sztuk lub wielokrotność 10. Jeżeli potrzebujesz 30 sztuk zamawiasz 30 ",null,{"$f":"VLOOKUP(B316,'Fire EN 54'!$D$5:$I$508,6,0)","v":"3"},"-","DE",{"$f":"VLOOKUP(B316,'Fire EN 54 FX 4,704'!$D$5:$L$500,9,0)","v":3926909790},{"$f":"VLOOKUP(B316,'Fire EN 54 FX 4,704'!$D$5:$O$500,12,0)","v":"0.001"}]
[null,"4.998.143.423","TITANUS AF-3.8","Folia redukcyjna 3,8mm (cena za 1szt)",{"$f":"VLOOKUP(B317,'Fire EN 54'!$D$5:$H$508,5,0)","v":{"v":10,"d":"10.00"}},"5A","A","Minimalne zamówienie paczka 10 sztuk lub wielokrotność 10. Jeżeli potrzebujesz 30 sztuk zamawiasz 30 ",null,{"$f":"VLOOKUP(B317,'Fire EN 54'!$D$5:$I$508,6,0)","v":"3"},"-","DE",{"$f":"VLOOKUP(B317,'Fire EN 54 FX 4,704'!$D$5:$L$500,9,0)","v":3926909790},{"$f":"VLOOKUP(B317,'Fire EN 54 FX 4,704'!$D$5:$O$500,12,0)","v":"0.366"}]
[null,"4.998.143.424","TITANUS AF-4.0","Folia redukcyjna4,0mm (cena za 1szt)",{"$f":"VLOOKUP(B318,'Fire EN 54'!$D$5:$H$508,5,0)","v":{"v":10,"d":"10.00"}},"5A","A","Minimalne zamówienie paczka 10 sztuk lub wielokrotność 10. Jeżeli potrzebujesz 30 sztuk zamawiasz 30 ",null,{"$f":"VLOOKUP(B318,'Fire EN 54'!$D$5:$I$508,6,0)","v":"3"},"-","DE",{"$f":"VLOOKUP(B318,'Fire EN 54 FX 4,704'!$D$5:$L$500,9,0)","v":3926909790},{"$f":"VLOOKUP(B318,'Fire EN 54 FX 4,704'!$D$5:$O$500,12,0)","v":"0.017"}]
[null,"4.998.143.425","TITANUS AF-4.2","Folia redukcyjna 4,2mm (cena za 1szt)",{"$f":"VLOOKUP(B319,'Fire EN 54'!$D$5:$H$508,5,0)","v":{"v":10,"d":"10.00"}},"5A","A","Minimalne zamówienie paczka 10 sztuk lub wielokrotność 10. Jeżeli potrzebujesz 30 sztuk zamawiasz 30 ",null,{"$f":"VLOOKUP(B319,'Fire EN 54'!$D$5:$I$508,6,0)","v":"3"},"-","DE",{"$f":"VLOOKUP(B319,'Fire EN 54 FX 4,704'!$D$5:$L$500,9,0)","v":3926909790},{"$f":"VLOOKUP(B319,'Fire EN 54 FX 4,704'!$D$5:$O$500,12,0)","v":"0.017"}]
[null,"4.998.143.426","TITANUS AF-4.4","Folia redukcyjna 4,4mm (cena za 1szt)",{"$f":"VLOOKUP(B320,'Fire EN 54'!$D$5:$H$508,5,0)","v":{"v":10,"d":"10.00"}},"5A","A","Minimalne zamówienie paczka 10 sztuk lub wielokrotność 10. Jeżeli potrzebujesz 30 sztuk zamawiasz 30 ",null,{"$f":"VLOOKUP(B320,'Fire EN 54'!$D$5:$I$508,6,0)","v":"3"},"-","DE",{"$f":"VLOOKUP(B320,'Fire EN 54 FX 4,704'!$D$5:$L$500,9,0)","v":3926909790},{"$f":"VLOOKUP(B320,'Fire EN 54 FX 4,704'!$D$5:$O$500,12,0)","v":"0.017"}]
[null,"4.998.143.427","TITANUS AF-4.6","Folia redukcyjna 4,6mm (cena za 1szt)",{"$f":"VLOOKUP(B321,'Fire EN 54'!$D$5:$H$508,5,0)","v":{"v":10,"d":"10.00"}},"5A","A","Minimalne zamówienie paczka 10 sztuk lub wielokrotność 10. Jeżeli potrzebujesz 30 sztuk zamawiasz 30 ",null,{"$f":"VLOOKUP(B321,'Fire EN 54'!$D$5:$I$508,6,0)","v":"3"},"-","DE",{"$f":"VLOOKUP(B321,'Fire EN 54 FX 4,704'!$D$5:$L$500,9,0)","v":3926909790},{"$f":"VLOOKUP(B321,'Fire EN 54 FX 4,704'!$D$5:$O$500,12,0)","v":"0.017"}]
[null,"4.998.143.428","TITANUS AF-5.0","Folia redukcyjna 5,0mm (cena za 1szt)",{"$f":"VLOOKUP(B322,'Fire EN 54'!$D$5:$H$508,5,0)","v":{"v":10,"d":"10.00"}},"5A","A","Minimalne zamówienie paczka 10 sztuk lub wielokrotność 10. Jeżeli potrzebujesz 30 sztuk zamawiasz 30 ",null,{"$f":"VLOOKUP(B322,'Fire EN 54'!$D$5:$I$508,6,0)","v":"3"},"-","DE",{"$f":"VLOOKUP(B322,'Fire EN 54 FX 4,704'!$D$5:$L$500,9,0)","v":3926909790},{"$f":"VLOOKUP(B322,'Fire EN 54 FX 4,704'!$D$5:$O$500,12,0)","v":"0.042"}]
[null,"4.998.143.429","TITANUS AF-5.2","Folia redukcyjna 5,2mm (cena za 1szt)",{"$f":"VLOOKUP(B323,'Fire EN 54'!$D$5:$H$508,5,0)","v":{"v":10,"d":"10.00"}},"5A","A","Minimalne zamówienie paczka 10 sztuk lub wielokrotność 10. Jeżeli potrzebujesz 30 sztuk zamawiasz 30 ",null,{"$f":"VLOOKUP(B323,'Fire EN 54'!$D$5:$I$508,6,0)","v":"3"},"-","DE",{"$f":"VLOOKUP(B323,'Fire EN 54 FX 4,704'!$D$5:$L$500,9,0)","v":3926909790},{"$f":"VLOOKUP(B323,'Fire EN 54 FX 4,704'!$D$5:$O$500,12,0)","v":"0.008"}]
[null,"4.998.143.430","TITANUS AF-5.6","Folia redukcyjna5,6mm (cena za 1szt)",{"$f":"VLOOKUP(B324,'Fire EN 54'!$D$5:$H$508,5,0)","v":{"v":10,"d":"10.00"}},"5A","A","Minimalne zamówienie paczka 10 sztuk lub wielokrotność 10. Jeżeli potrzebujesz 30 sztuk zamawiasz 30 ",null,{"$f":"VLOOKUP(B324,'Fire EN 54'!$D$5:$I$508,6,0)","v":"3"},"-","DE",{"$f":"VLOOKUP(B324,'Fire EN 54 FX 4,704'!$D$5:$L$500,9,0)","v":3926909790},{"$f":"VLOOKUP(B324,'Fire EN 54 FX 4,704'!$D$5:$O$500,12,0)","v":"0.003"}]
[null,"4.998.143.431","TITANUS AF-6.0","Folia redukcyjna 6,0mm (cena za 1szt)",{"$f":"VLOOKUP(B325,'Fire EN 54'!$D$5:$H$508,5,0)","v":{"v":10,"d":"10.00"}},"5A","A","Minimalne zamówienie paczka 10 sztuk lub wielokrotność 10. Jeżeli potrzebujesz 30 sztuk zamawiasz 30 ",null,{"$f":"VLOOKUP(B325,'Fire EN 54'!$D$5:$I$508,6,0)","v":"3"},"-","DE",{"$f":"VLOOKUP(B325,'Fire EN 54 FX 4,704'!$D$5:$L$500,9,0)","v":3926909790},{"$f":"VLOOKUP(B325,'Fire EN 54 FX 4,704'!$D$5:$O$500,12,0)","v":"0.017"}]
[null,"4.998.143.432","TITANUS AF-6.8","Folia redukcyjna 6,8mm (cena za 1szt)",{"$f":"VLOOKUP(B326,'Fire EN 54'!$D$5:$H$508,5,0)","v":{"v":10,"d":"10.00"}},"5A","A","Minimalne zamówienie paczka 10 sztuk lub wielokrotność 10. Jeżeli potrzebujesz 30 sztuk zamawiasz 30 ",null,{"$f":"VLOOKUP(B326,'Fire EN 54'!$D$5:$I$508,6,0)","v":"3"},"-","DE",{"$f":"VLOOKUP(B326,'Fire EN 54 FX 4,704'!$D$5:$L$500,9,0)","v":3926909790},{"$f":"VLOOKUP(B326,'Fire EN 54 FX 4,704'!$D$5:$O$500,12,0)","v":"0.017"}]
[null,"4.998.143.433","TITANUS AF-7.0","Folia redukcyjna 7,0mm (cena za 1szt)",{"$f":"VLOOKUP(B327,'Fire EN 54'!$D$5:$H$508,5,0)","v":{"v":10,"d":"10.00"}},"5A","A","Minimalne zamówienie paczka 10 sztuk lub wielokrotność 10. Jeżeli potrzebujesz 30 sztuk zamawiasz 30 ",null,{"$f":"VLOOKUP(B327,'Fire EN 54'!$D$5:$I$508,6,0)","v":"3"},"-","DE",{"$f":"VLOOKUP(B327,'Fire EN 54 FX 4,704'!$D$5:$L$500,9,0)","v":3926909790},{"$f":"VLOOKUP(B327,'Fire EN 54 FX 4,704'!$D$5:$O$500,12,0)","v":"0.017"}]
[null,"4.998.148.848","RAS test-pipe","Rurka testowa",{"$f":"VLOOKUP(B328,'Fire EN 54'!$D$5:$H$508,5,0)","v":{"v":337,"d":"337.00"}},"5A","A",null,null,{"$f":"VLOOKUP(B328,'Fire EN 54'!$D$5:$I$508,6,0)","v":"3"},"-","DE",{"$f":"VLOOKUP(B328,'Fire EN 54 FX 4,704'!$D$5:$L$500,9,0)","v":8531900000},{"$f":"VLOOKUP(B328,'Fire EN 54 FX 4,704'!$D$5:$O$500,12,0)","v":"0.12"}]
[null,"4.998.148.849","RAS test adapter","Adapter testowy ",{"$f":"VLOOKUP(B329,'Fire EN 54'!$D$5:$H$508,5,0)","v":{"v":211,"d":"211.00"}},"5A","A",null,null,{"$f":"VLOOKUP(B329,'Fire EN 54'!$D$5:$I$508,6,0)","v":"3"},"-","DE",{"$f":"VLOOKUP(B329,'Fire EN 54 FX 4,704'!$D$5:$L$500,9,0)","v":3917400099},{"$f":"VLOOKUP(B329,'Fire EN 54 FX 4,704'!$D$5:$O$500,12,0)","v":"0.116"}]
[null,"F.01U.033.505","FAS-ASD-DIAG","Diagnostic cable incl software DIAG 3",{"$f":"VLOOKUP(B330,'Fire EN 54'!$D$5:$H$508,5,0)","v":{"v":4531,"d":"4531.00"}},"5A","A",null,null,{"$f":"VLOOKUP(B330,'Fire EN 54'!$D$5:$I$508,6,0)","v":"3"},"-","DE",{"$f":"VLOOKUP(B330,'Fire EN 54 FX 4,704'!$D$5:$L$500,9,0)","v":8523491000},{"$f":"VLOOKUP(B330,'Fire EN 54 FX 4,704'!$D$5:$O$500,12,0)","v":"0.6"}]
[null,"F.01U.029.727","FAS-ASD-AHC","Wężyk zasysający do sufitu",{"$f":"VLOOKUP(B331,'Fire EN 54'!$D$5:$H$508,5,0)","v":{"v":3175,"d":"3175.00"}},"5A","C",null,null,{"$f":"VLOOKUP(B331,'Fire EN 54'!$D$5:$I$508,6,0)","v":"3"},"-","DE",{"$f":"VLOOKUP(B331,'Fire EN 54 FX 4,704'!$D$5:$L$500,9,0)","v":3917320099},{"$f":"VLOOKUP(B331,'Fire EN 54 FX 4,704'!$D$5:$O$500,12,0)","v":"1.98"}]
[null,"F.01U.029.725","FAS-ASD-CLT","Przelotka sufitowa ( cena za sztukę)",{"$f":"VLOOKUP(B332,'Fire EN 54'!$D$5:$H$508,5,0)","v":{"v":108,"d":"108.00"}},"5A","C","Minimalne zamówienie paczka 10 sztuk lub wielokrotność 10",null,{"$f":"VLOOKUP(B332,'Fire EN 54'!$D$5:$I$508,6,0)","v":"3"},"-","DE",{"$f":"VLOOKUP(B332,'Fire EN 54 FX 4,704'!$D$5:$L$500,9,0)","v":3917400099},{"$f":"VLOOKUP(B332,'Fire EN 54 FX 4,704'!$D$5:$O$500,12,0)","v":"0.009"}]
[null,"F.01U.029.724","FAS-ASD-AR","Redukcja zasysania ",{"$f":"VLOOKUP(B333,'Fire EN 54'!$D$5:$H$508,5,0)","v":{"v":39,"d":"39.00"}},"5A","C",null,null,{"$f":"VLOOKUP(B333,'Fire EN 54'!$D$5:$I$508,6,0)","v":"3"},"-","DE",{"$f":"VLOOKUP(B333,'Fire EN 54 FX 4,704'!$D$5:$L$500,9,0)","v":3926909790},{"$f":"VLOOKUP(B333,'Fire EN 54 FX 4,704'!$D$5:$O$500,12,0)","v":"0.01"}]
[null,"F.01U.029.722","FAS-ASD-F","Kołnierz",{"$f":"VLOOKUP(B334,'Fire EN 54'!$D$5:$H$508,5,0)","v":{"v":278,"d":"278.00"}},"5A","C",null,null,{"$f":"VLOOKUP(B334,'Fire EN 54'!$D$5:$I$508,6,0)","v":"3"},"-","DE",{"$f":"VLOOKUP(B334,'Fire EN 54 FX 4,704'!$D$5:$L$500,9,0)","v":3926909790},{"$f":"VLOOKUP(B334,'Fire EN 54 FX 4,704'!$D$5:$O$500,12,0)","v":"0.333"}]
[null,"F.01U.029.721","FAS-ASD-TRPG16","Gwintowany  pierścień, PG 16",{"$f":"VLOOKUP(B335,'Fire EN 54'!$D$5:$H$508,5,0)","v":{"v":46,"d":"46.00"}},"5A","C",null,null,{"$f":"VLOOKUP(B335,'Fire EN 54'!$D$5:$I$508,6,0)","v":"3"},"-","DE",{"$f":"VLOOKUP(B335,'Fire EN 54 FX 4,704'!$D$5:$L$500,9,0)","v":3917400099},{"$f":"VLOOKUP(B335,'Fire EN 54 FX 4,704'!$D$5:$O$500,12,0)","v":"0.09"}]
[null,"F.01U.029.720","FAS-ASD-CSL","Połaczenie linia prostą ",{"$f":"VLOOKUP(B336,'Fire EN 54'!$D$5:$H$508,5,0)","v":{"v":39,"d":"39.00"}},"5A","C",null,null,{"$f":"VLOOKUP(B336,'Fire EN 54'!$D$5:$I$508,6,0)","v":"3"},"-","DE",{"$f":"VLOOKUP(B336,'Fire EN 54 FX 4,704'!$D$5:$L$500,9,0)","v":3917400099},{"$f":"VLOOKUP(B336,'Fire EN 54 FX 4,704'!$D$5:$O$500,12,0)","v":"0.017"}]
[null,"F.01U.029.719","FAS-ASD-PHF16","Elastyczny wąż, PG 16",{"$f":"VLOOKUP(B337,'Fire EN 54'!$D$5:$H$508,5,0)","v":{"v":2455,"d":"2455.00"}},"5A","C",null,null,{"$f":"VLOOKUP(B337,'Fire EN 54'!$D$5:$I$508,6,0)","v":"3"},"-","DE",{"$f":"VLOOKUP(B337,'Fire EN 54 FX 4,704'!$D$5:$L$500,9,0)","v":3917320099},{"$f":"VLOOKUP(B337,'Fire EN 54 FX 4,704'!$D$5:$O$500,12,0)","v":"2.42"}]
[null,"F.01U.029.718","FAS-ASD-3WT","Trójnik",{"$f":"VLOOKUP(B338,'Fire EN 54'!$D$5:$H$508,5,0)","v":{"v":1146,"d":"1146.00"}},"5A","C",null,null,{"$f":"VLOOKUP(B338,'Fire EN 54'!$D$5:$I$508,6,0)","v":"3"},"-","DE",{"$f":"VLOOKUP(B338,'Fire EN 54 FX 4,704'!$D$5:$L$500,9,0)","v":8481808190},{"$f":"VLOOKUP(B338,'Fire EN 54 FX 4,704'!$D$5:$O$500,12,0)","v":"0.306"}]
[null,"F.01U.029.717","FAS-ASD-WS","Rozdzielacz wody",{"$f":"VLOOKUP(B339,'Fire EN 54'!$D$5:$H$508,5,0)","v":{"v":2946,"d":"2946.00"}},"5A","C",null,null,{"$f":"VLOOKUP(B339,'Fire EN 54'!$D$5:$I$508,6,0)","v":"3"},"-","DE",{"$f":"VLOOKUP(B339,'Fire EN 54 FX 4,704'!$D$5:$L$500,9,0)","v":8421210090},{"$f":"VLOOKUP(B339,'Fire EN 54 FX 4,704'!$D$5:$O$500,12,0)","v":"1.324"}]
[null,"F.01U.029.716","FAS-ASD-DSB","Bariera zabezpieczająca",{"$f":"VLOOKUP(B340,'Fire EN 54'!$D$5:$H$508,5,0)","v":{"v":11785,"d":"11785.00"}},"5A","C",null,null,{"$f":"VLOOKUP(B340,'Fire EN 54'!$D$5:$I$508,6,0)","v":"3"},"-","DE",{"$f":"VLOOKUP(B340,'Fire EN 54 FX 4,704'!$D$5:$L$500,9,0)","v":7326909890},{"$f":"VLOOKUP(B340,'Fire EN 54 FX 4,704'!$D$5:$O$500,12,0)","v":"1.341"}]
[null,"F.01U.029.715","FAS-ASD-RFL","Zamiennik filtr duży ",{"$f":"VLOOKUP(B341,'Fire EN 54'!$D$5:$H$508,5,0)","v":{"v":236,"d":"236.00"}},"5A","C",null,null,{"$f":"VLOOKUP(B341,'Fire EN 54'!$D$5:$I$508,6,0)","v":"3"},"-","DE",{"$f":"VLOOKUP(B341,'Fire EN 54 FX 4,704'!$D$5:$L$500,9,0)","v":84219900},{"$f":"VLOOKUP(B341,'Fire EN 54 FX 4,704'!$D$5:$O$500,12,0)","v":"0.018"}]
[null,"F.01U.029.714","FAS-ASD-FL","Filtr duże pudełko",{"$f":"VLOOKUP(B342,'Fire EN 54'!$D$5:$H$508,5,0)","v":{"v":1179,"d":"1179.00"}},"5A","C",null,null,{"$f":"VLOOKUP(B342,'Fire EN 54'!$D$5:$I$508,6,0)","v":"3"},"-","DE",{"$f":"VLOOKUP(B342,'Fire EN 54 FX 4,704'!$D$5:$L$500,9,0)","v":8421999099},{"$f":"VLOOKUP(B342,'Fire EN 54 FX 4,704'!$D$5:$O$500,12,0)","v":"0.43"}]
["Centrale konwencjonalne FPC 500"]
[null,"F.01U.164.791","FPC-500-2","Centrala konwencjonalna 2 linie",{"$f":"VLOOKUP(B344,'Fire EN 54'!$D$5:$H$508,5,0)","v":{"v":1868,"d":"1868.00"}},"5A","A",null,"Uwaga! Brak wymaganego Świadectwa Dopuszczenia.",{"$f":"VLOOKUP(B344,'Fire EN 54'!$D$5:$I$508,6,0)","v":"5"},"-","CN",{"$f":"VLOOKUP(B344,'Fire EN 54 FX 4,704'!$D$5:$L$500,9,0)","v":8531103000},{"$f":"VLOOKUP(B344,'Fire EN 54 FX 4,704'!$D$5:$O$500,12,0)","v":"2.2"}]
[null,"F.01U.164.792","FPC-500-4","Centrala konwencjonalna 4 linie",{"$f":"VLOOKUP(B345,'Fire EN 54'!$D$5:$H$508,5,0)","v":{"v":2303,"d":"2303.00"}},"5A","A",null,"Uwaga! Brak wymaganego Świadectwa Dopuszczenia.",{"$f":"VLOOKUP(B345,'Fire EN 54'!$D$5:$I$508,6,0)","v":"5"},"-","CN",{"$f":"VLOOKUP(B345,'Fire EN 54 FX 4,704'!$D$5:$L$500,9,0)","v":8531103000},{"$f":"VLOOKUP(B345,'Fire EN 54 FX 4,704'!$D$5:$O$500,12,0)","v":"3.456"}]
[null,"F.01U.164.793","FPC-500-8","Centrala konwencjonalna 8 linie",{"$f":"VLOOKUP(B346,'Fire EN 54'!$D$5:$H$508,5,0)","v":{"v":2882,"d":"2882.00"}},"5A","A",null,"Uwaga! Brak wymaganego Świadectwa Dopuszczenia.",{"$f":"VLOOKUP(B346,'Fire EN 54'!$D$5:$I$508,6,0)","v":"5"},"-","CN",{"$f":"VLOOKUP(B346,'Fire EN 54 FX 4,704'!$D$5:$L$500,9,0)","v":8531103000},{"$f":"VLOOKUP(B346,'Fire EN 54 FX 4,704'!$D$5:$O$500,12,0)","v":"3.42"}]
[null,"F.01U.164.794","FPC-500-OCEXT","Płytka rozszerzeń OC",{"$f":"VLOOKUP(B347,'Fire EN 54'!$D$5:$H$508,5,0)","v":{"v":217,"d":"217.00"}},"5A","A",null,"Uwaga! Brak wymaganego Świadectwa Dopuszczenia.",{"$f":"VLOOKUP(B347,'Fire EN 54'!$D$5:$I$508,6,0)","v":"5"},"-","CN",{"$f":"VLOOKUP(B347,'Fire EN 54 FX 4,704'!$D$5:$L$500,9,0)","v":8531900000},{"$f":"VLOOKUP(B347,'Fire EN 54 FX 4,704'!$D$5:$O$500,12,0)","v":"0.1"}]
[null,"F.01U.164.795","FPC-500-RLYEXT","Płytka rozszerzeń przekaźników",{"$f":"VLOOKUP(B348,'Fire EN 54'!$D$5:$H$508,5,0)","v":{"v":406,"d":"406.00"}},"5A","A",null,"Uwaga! Brak wymaganego Świadectwa Dopuszczenia.",{"$f":"VLOOKUP(B348,'Fire EN 54'!$D$5:$I$508,6,0)","v":"5"},"-","CN",{"$f":"VLOOKUP(B348,'Fire EN 54 FX 4,704'!$D$5:$L$500,9,0)","v":8531900000},{"$f":"VLOOKUP(B348,'Fire EN 54 FX 4,704'!$D$5:$O$500,12,0)","v":"0.1"}]
[null,"F.01U.164.844","FPC-500-KEY","Klucz dostepu centrali",{"$f":"VLOOKUP(B349,'Fire EN 54'!$D$5:$H$508,5,0)","v":{"v":145,"d":"145.00"}},"5A","A",null,"Uwaga! Brak wymaganego Świadectwa Dopuszczenia.",{"$f":"VLOOKUP(B349,'Fire EN 54'!$D$5:$I$508,6,0)","v":"5"},"-","CN",{"$f":"VLOOKUP(B349,'Fire EN 54 FX 4,704'!$D$5:$L$500,9,0)","v":3926909790},{"$f":"VLOOKUP(B349,'Fire EN 54 FX 4,704'!$D$5:$O$500,12,0)","v":"0.01"}]
["Konwencjonalne czujki pożarowe "]
["Czujki serii 320 "]
[null,"F.01U.026.293","FCP-O320","Optyczna czujka dymu",{"$f":"VLOOKUP(B352,'Fire EN 54'!$D$5:$H$508,5,0)","v":{"v":192,"d":"192.00"}},"5A","A",null,null,{"$f":"VLOOKUP(B352,'Fire EN 54'!$D$5:$I$508,6,0)","v":"5"},"-","CN",{"$f":"VLOOKUP(B352,'Fire EN 54 FX 4,704'!$D$5:$L$500,9,0)","v":8531103000},{"$f":"VLOOKUP(B352,'Fire EN 54 FX 4,704'!$D$5:$O$500,12,0)","v":"0.072"}]
[null,"F.01U.026.292","FCP-OC320","Multidetektorowa czujka optyczno / chemiczna (CO)",{"$f":"VLOOKUP(B353,'Fire EN 54'!$D$5:$H$508,5,0)","v":{"v":847,"d":"847.00"}},"5A","A",null,null,{"$f":"VLOOKUP(B353,'Fire EN 54'!$D$5:$I$508,6,0)","v":"5"},"-","CN",{"$f":"VLOOKUP(B353,'Fire EN 54 FX 4,704'!$D$5:$L$500,9,0)","v":8531103000},{"$f":"VLOOKUP(B353,'Fire EN 54 FX 4,704'!$D$5:$O$500,12,0)","v":"0.1"}]
[null,"F.01U.026.295","FCP-OT320","Multidetektorowa czujka optyczno / termiczna",{"$f":"VLOOKUP(B354,'Fire EN 54'!$D$5:$H$508,5,0)","v":{"v":332,"d":"332.00"}},"5A","A",null,null,{"$f":"VLOOKUP(B354,'Fire EN 54'!$D$5:$I$508,6,0)","v":"5"},"-","CN",{"$f":"VLOOKUP(B354,'Fire EN 54 FX 4,704'!$D$5:$L$500,9,0)","v":8531103000},{"$f":"VLOOKUP(B354,'Fire EN 54 FX 4,704'!$D$5:$O$500,12,0)","v":"0.09"}]
[null,"F.01U.026.291","FCH-T320","Czujka termiczna",{"$f":"VLOOKUP(B355,'Fire EN 54'!$D$5:$H$508,5,0)","v":{"v":147,"d":"147.00"}},"5A","A",null,null,{"$f":"VLOOKUP(B355,'Fire EN 54'!$D$5:$I$508,6,0)","v":"5"},"-","CN",{"$f":"VLOOKUP(B355,'Fire EN 54 FX 4,704'!$D$5:$L$500,9,0)","v":8531103000},{"$f":"VLOOKUP(B355,'Fire EN 54 FX 4,704'!$D$5:$O$500,12,0)","v":"0.069"}]
[null,"F.01U.029.857","FCP-O320-R470","Optyczna czujka dymu",{"$f":"VLOOKUP(B356,'Fire EN 54'!$D$5:$H$508,5,0)","v":{"v":192,"d":"192.00"}},"5A","A",null,null,{"$f":"VLOOKUP(B356,'Fire EN 54'!$D$5:$I$508,6,0)","v":"5"},"-","CN",{"$f":"VLOOKUP(B356,'Fire EN 54 FX 4,704'!$D$5:$L$500,9,0)","v":8531900000},{"$f":"VLOOKUP(B356,'Fire EN 54 FX 4,704'!$D$5:$O$500,12,0)","v":"0.09"}]
[null,"F.01U.029.867","FCP-OC320-R470","Multidetektorowa czujka optyczno / chemiczna (CO)",{"$f":"VLOOKUP(B357,'Fire EN 54'!$D$5:$H$508,5,0)","v":{"v":847,"d":"847.00"}},"5A","A",null,null,{"$f":"VLOOKUP(B357,'Fire EN 54'!$D$5:$I$508,6,0)","v":"5"},"-","CN",{"$f":"VLOOKUP(B357,'Fire EN 54 FX 4,704'!$D$5:$L$500,9,0)","v":8531103000},{"$f":"VLOOKUP(B357,'Fire EN 54 FX 4,704'!$D$5:$O$500,12,0)","v":"0.09"}]
[null,"F.01U.029.862","FCP-OT320-R470","Multidetektorowa czujka optyczno / termiczna",{"$f":"VLOOKUP(B358,'Fire EN 54'!$D$5:$H$508,5,0)","v":{"v":332,"d":"332.00"}},"5A","A",null,null,{"$f":"VLOOKUP(B358,'Fire EN 54'!$D$5:$I$508,6,0)","v":"5"},"-","CN",{"$f":"VLOOKUP(B358,'Fire EN 54 FX 4,704'!$D$5:$L$500,9,0)","v":8531103000},{"$f":"VLOOKUP(B358,'Fire EN 54 FX 4,704'!$D$5:$O$500,12,0)","v":"0.091"}]
[null,"F.01U.029.861","FCH-T320-R470","Czujka termiczna",{"$f":"VLOOKUP(B359,'Fire EN 54'!$D$5:$H$508,5,0)","v":{"v":147,"d":"147.00"}},"5A","A",null,null,{"$f":"VLOOKUP(B359,'Fire EN 54'!$D$5:$I$508,6,0)","v":"5"},"-","CN",{"$f":"VLOOKUP(B359,'Fire EN 54 FX 4,704'!$D$5:$L$500,9,0)","v":8531103000},{"$f":"VLOOKUP(B359,'Fire EN 54 FX 4,704'!$D$5:$O$500,12,0)","v":"0.099"}]
["Konwencjonalne ręczne ostrzegacze pożarowe "]
["ROP seria konwencjonalna FMC"]
[null,"F.01U.012.771","FMC-300RW-GSGRD","ROP jednostadiowy czerwony",{"$f":"VLOOKUP(B362,'Fire EN 54'!$D$5:$H$508,5,0)","v":{"v":177,"d":"177.00"}},"5A","A",null,"Uwaga! Brak wymaganego Świadectwa Dopuszczenia.",{"$f":"VLOOKUP(B362,'Fire EN 54'!$D$5:$I$508,6,0)","v":"3"},"-","CN",{"$f":"VLOOKUP(B362,'Fire EN 54 FX 4,704'!$D$5:$L$500,9,0)","v":8536501999},{"$f":"VLOOKUP(B362,'Fire EN 54 FX 4,704'!$D$5:$O$500,12,0)","v":"0.249"}]
[null,"F.01U.012.777","FMC-300RW-GSRRD","ROP jednostadiowy czerwony z możliwością resetu",{"$f":"VLOOKUP(B363,'Fire EN 54'!$D$5:$H$508,5,0)","v":{"v":177,"d":"177.00"}},"5A","A",null,"Uwaga! Brak wymaganego Świadectwa Dopuszczenia.",{"$f":"VLOOKUP(B363,'Fire EN 54'!$D$5:$I$508,6,0)","v":"3"},"-","CN",{"$f":"VLOOKUP(B363,'Fire EN 54 FX 4,704'!$D$5:$L$500,9,0)","v":8536501999},{"$f":"VLOOKUP(B363,'Fire EN 54 FX 4,704'!$D$5:$O$500,12,0)","v":"0.27"}]
["KONIEC CENNIKA"]
[]
["Legenda:"]
["kolor czerwony - nowe produkty "]
["kolor niebieski - zmiana ceny"]
["kolor szary produkty wycofane z cennika "]
["Przy składaniu ofert na produkty zawarte w cenniku należy zweryfikować czy produkt posiada aktualne wymagane certyfikaty"]
["certyfikaty do pobrania pod produktami na stronie www.boschsecurity.pl"]

{"sheet":"Cennik Titanus - pozostałe","index":2,"n_rows":41,"n_cols":8,"rows_kept":41,"merged":[[1,0,2,7],[4,0,4,7]]}
[]
["W przypadku zamówień mniejszych niż 7000PLN REUP (jednorazowa kwota zamówienia obejmująca tylko poniższe produkty) doliczamy opłatę za transport 200PLN. "]
[]
["SAP","TYP","OPIS","CENA REUP PLN","CENA EUR","CENA REUP PLN","Grupa rabatowa","Informacje dodatkowe"]
[]
["F.01U.363.332","PL - SF 400","Special filter 400mm",{"v":4191,"d":"4191.00"},{"$f":"D6/4.165","v":{"v":1006.2424969987995,"d":"1006.24"}},{"$f":"ROUND(ROUND(E6*4.704,2),0)","v":{"v":4733,"d":"4733.00"}},"5A"]
["F.01U.363.333","PL - SF 650","Special filter 650mm",{"v":5272,"d":"5272.00"},{"$f":"D7/4.165","v":{"v":1265.7863145258102,"d":"1265.79"}},{"$f":"ROUND(ROUND(E7*4.704,2),0)","v":{"v":5954,"d":"5954.00"}},"5A"]
["F.01U.363.334","PL - LF-AD-2","Filter medium-superfine-coarse-filtermat",{"v":1993,"d":"1993.00"},{"v":478.51140456182475,"d":"478.51"},{"v":2251,"d":"2251.00"},"5A"]
["F.01U.363.335","PL - RSV-R25","Non return valve, spring loaded",{"v":893,"d":"893.00"},{"v":214.40576230492198,"d":"214.41"},{"v":1009,"d":"1009.00"},"5A"]
["F.01U.363.336","PL - KA-1","Steam trap",{"v":2328,"d":"2328.00"},{"v":558.9435774309724,"d":"558.94"},{"v":2629,"d":"2629.00"},"5A"]
["F.01U.363.337","PL - AK-2,0","Airflow 2,0mm reducer for deep freeze",{"v":93,"d":"93.00"},{"v":22.328931572629052,"d":"22.33"},{"v":105,"d":"105.00"},"5A","Minimalne zamówienie paczka 10 sztuk lub wielokrotność 10. Jeżeli potrzebujesz 30 sztuk zamawiasz 30 "]
["F.01U.363.338","PL - AK-2,5","Airflow 2,5mm reducer for deep freeze",{"v":93,"d":"93.00"},{"v":22.328931572629052,"d":"22.33"},{"v":105,"d":"105.00"},"5A","Minimalna wielkość zamówienia 10 sztuk, cena za sztukę. Zamawiać 10 lub wielokrotność 10."]
["F.01U.363.339","PL - AK-3,0","Airflow 3,0mm reducer for deep freeze",{"v":93,"d":"93.00"},{"v":22.328931572629052,"d":"22.33"},{"v":105,"d":"105.00"},"5A","Minimalna wielkość zamówienia 10 sztuk, cena za sztukę. Zamawiać 10 lub wielokrotność 10."]
["F.01U.363.340","PL - AK-3,2","Airflow 3,2mm reducer for deep freeze",{"v":93,"d":"93.00"},{"v":22.328931572629052,"d":"22.33"},{"v":105,"d":"105.00"},"5A","Minimalna wielkość zamówienia 10 sztuk, cena za sztukę. Zamawiać 10 lub wielokrotność 10."]
["F.01U.363.341","PL - AK-3,4","Airflow 3,4mm reducer for deep freeze",{"v":93,"d":"93.00"},{"v":22.328931572629052,"d":"22.33"},{"v":105,"d":"105.00"},"5A","Minimalna wielkość zamówienia 10 sztuk, cena za sztukę. Zamawiać 10 lub wielokrotność 10."]
["F.01U.363.342","PL - AK-3,6","Airflow 3,6mm reducer for deep freeze",{"v":93,"d":"93.00"},{"v":22.328931572629052,"d":"22.33"},{"v":105,"d":"105.00"},"5A","Minimalna wielkość zamówienia 10 sztuk, cena za sztukę. Zamawiać 10 lub wielokrotność 10."]
["F.01U.363.343","PL - AK-3,8","Airflow 3,8mm reducer for deep freeze",{"v":93,"d":"93.00"},{"v":22.328931572629052,"d":"22.33"},{"v":105,"d":"105.00"},"5A","Minimalna wielkość zamówienia 10 sztuk, cena za sztukę. Zamawiać 10 lub wielokrotność 10."]
["F.01U.363.344","PL - AK-4,0","Airflow 4,0mm reducer for deep freeze",{"v":93,"d":"93.00"},{"v":22.328931572629052,"d":"22.33"},{"v":105,"d":"105.00"},"5A","Minimalna wielkość zamówienia 10 sztuk, cena za sztukę. Zamawiać 10 lub wielokrotność 10."]
["F.01U.363.345","PL - AK-4,2","Airflow 4,2mm reducer for deep freeze",{"v":93,"d":"93.00"},{"v":22.328931572629052,"d":"22.33"},{"v":105,"d":"105.00"},"5A","Minimalna wielkość zamówienia 10 sztuk, cena za sztukę. Zamawiać 10 lub wielokrotność 10."]
["F.01U.363.346","PL - AK-4,4","Airflow 4,4mm reducer for deep freeze",{"v":93,"d":"93.00"},{"v":22.328931572629052,"d":"22.33"},{"v":105,"d":"105.00"},"5A","Minimalna wielkość zamówienia 10 sztuk, cena za sztukę. Zamawiać 10 lub wielokrotność 10."]
["F.01U.363.347","PL - AK-4,6","Airflow 4,6mm reducer for deep freeze",{"v":93,"d":"93.00"},{"v":22.328931572629052,"d":"22.33"},{"v":105,"d":"105.00"},"5A","Minimalna wielkość zamówienia 10 sztuk, cena za sztukę. Zamawiać 10 lub wielokrotność 10."]
["F.01U.363.348","PL - AK-5,0","Airflow 5,0mm reducer for deep freeze",{"v":93,"d":"93.00"},{"v":22.328931572629052,"d":"22.33"},{"v":105,"d":"105.00"},"5A","Minimalna wielkość zamówienia 10 sztuk, cena za sztukę. Zamawiać 10 lub wielokrotność 10."]
["F.01U.363.349","PL - AK-5,2","Airflow 5,2mm reducer for deep freeze",{"v":93,"d":"93.00"},{"v":22.328931572629052,"d":"22.33"},{"v":105,"d":"105.00"},"5A","Minimalna wielkość zamówienia 10 sztuk, cena za sztukę. Zamawiać 10 lub wielokrotność 10."]
["F.01U.363.350","PL - AK-5,6","Airflow 5,6mm reducer for deep freeze",{"v":93,"d":"93.00"},{"v":22.328931572629052,"d":"22.33"},{"v":105,"d":"105.00"},"5A","Minimalna wielkość zamówienia 10 sztuk, cena za sztukę. Zamawiać 10 lub wielokrotność 10."]
["F.01U.363.351","PL - AK-6,0","Airflow 6,0mm reducer for deep freeze",{"v":93,"d":"93.00"},{"v":22.328931572629052,"d":"22.33"},{"v":105,"d":"105.00"},"5A","Minimalna wielkość zamówienia 10 sztuk, cena za sztukę. Zamawiać 10 lub wielokrotność 10."]
["F.01U.363.352","PL - AK-6,8","Airflow 6,8mm reducer for deep freeze",{"v":93,"d":"93.00"},{"v":22.328931572629052,"d":"22.33"},{"v":105,"d":"105.00"},"5A","Minimalna wielkość zamówienia 10 sztuk, cena za sztukę. Zamawiać 10 lub wielokrotność 10."]
["F.01U.363.353","PL - AK-7","Airflow 7,0mm reducer for deep freeze",{"v":93,"d":"93.00"},{"v":22.328931572629052,"d":"22.33"},{"v":105,"d":"105.00"},"5A","Minimalna wielkość zamówienia 10 sztuk, cena za sztukę. Zamawiać 10 lub wielokrotność 10."]
["F.01U.363.354","PL - AK-C","Plastic clip for airflow reducer",{"v":64,"d":"64.00"},{"v":15.366146458583433,"d":"15.37"},{"v":72,"d":"72.00"},"5A","Minimalna wielkość zamówienia 10 sztuk, cena za sztukę. Zamawiać 10 lub wielokrotność 10."]
["F.01U.363.355","PL  - K.Schell.","Plastic clip",{"v":39,"d":"39.00"},{"v":9.363745498199279,"d":"9.36"},{"v":44,"d":"44.00"},"5A"]
["F.01U.363.356","PL - CT-1","Smoke pen",{"v":890,"d":"890.00"},{"v":213.68547418967586,"d":"213.69"},{"v":1005,"d":"1005.00"},"5A"]
["F.01U.363.357","PL - AK-CT-1","Fixing tool for smoke pen",{"v":267,"d":"267.00"},{"v":64.10564225690275,"d":"64.11"},{"v":302,"d":"302.00"},"5A"]
["F.01U.363.358","PL - SP-CT-1","Smoke sticks for smoke pen",{"v":793,"d":"793.00"},{"v":190.39615846338535,"d":"190.40"},{"v":896,"d":"896.00"},"5A"]
["F.01U.363.359","PL - TP-1-F/a","TITANUS PRO ·SENS ®",{"v":11109,"d":"11109.00"},{"v":2667.2268907563025,"d":"2667.23"},{"v":12547,"d":"12547.00"},"5A","Czujka wymaga dokupienia folii FW-TP-PL"]
["F.01U.363.360","PL - DM-TP10-LF","Detector module TITANUS PRO·SENS®",{"v":6767,"d":"6767.00"},{"v":1624.7298919567827,"d":"1624.73"},{"v":7643,"d":"7643.00"},"5A"]
["F.01U.363.361","PL - DM-TP01-LF","Detector module TITANUS PRO·SENS®",{"v":21946,"d":"21946.00"},{"v":5269.147659063626,"d":"5269.15"},{"v":24786,"d":"24786.00"},"5A"]
["F.01U.363.362","PL - DM-TP50-LF","Detector module TITANUS PRO·SENS®",{"v":4939,"d":"4939.00"},{"v":1185.8343337334934,"d":"1185.83"},{"v":5578,"d":"5578.00"},"5A"]
["F.01U.363.363","PL - TT-1-F/a","TITANUS TOP·SENS®",{"v":29074,"d":"29074.00"},{"v":6980.552220888355,"d":"6980.55"},{"v":32837,"d":"32837.00"},"5A","Czujka wymaga dokupienia folii FW-TP-PL"]
["F.01U.363.364","PL - DM-TT10-LF","Detector module TITANUS TOP·SENS®",{"v":6767,"d":"6767.00"},{"v":1624.7298919567827,"d":"1624.73"},{"v":7643,"d":"7643.00"},"5A"]
["F.01U.363.365","PL - DM-TT01-LF","Detector module TITANUS TOP·SENS®",{"v":21946,"d":"21946.00"},{"v":5269.147659063626,"d":"5269.15"},{"v":24786,"d":"24786.00"},"5A"]
["F.01U.363.366","PL - DM-TT50-LF","Detector module TITANUS TOP·SENS®",{"v":4939,"d":"4939.00"},{"v":1185.8343337334934,"d":"1185.83"},{"v":5578,"d":"5578.00"},"5A"]
["F.01U.399.609","FW-TP-PL","Front foil TITANUS",{"v":133,"d":"133.00"},{"v":31.932773109243698,"d":"31.93"},{"v":150,"d":"150.00"},"5A"]

{"sheet":"Dodatkowa gwarancja","index":3,"n_rows":15,"n_cols":7,"rows_kept":15,"hidden":true,"merged":[[1,0,2,6],[3,0,3,6]]}
[]
["Ceny rozszerzeń gwarancji nie podlegają rabatowaniu projektowemu. Przyznawany jest tylko rabat bazowy."]
[]
["Zamawiasz tyle sztuk, ile sztuk danego produktu chcesz objąć dodatkową gwarancją na 12-msc. Dwukrotność tej ilości, aby zapewnić dodatkowe 24-msc (maksymalna długość gwarancji razem wynosi 5 lat)."]
["SAP","TYP","OPIS","stara CENA REUP PLN","CENA REUP PLN","Grupa rabatowa","Informacje do zamówienia"]
["F.01U.360.726","EWE-FPA5MPC-IW","12 msc. rozszrzerzenie gwarancji na kontroler centrali FPA-5000",{"v":85,"d":"85.00"},{"$f":"VLOOKUP(A6,'Warranty Extension'!$B$3:$G$20,5,0)","v":{"v":103,"d":"103.00"}},"5A"]
["F.01U.360.727","EWE-FPA5FMR-IW","12 msc. rozszrzenie gwarancji na panel wyniesiony FMR-5000",{"v":113,"d":"113.00"},{"$f":"VLOOKUP(A7,'Warranty Extension'!$B$3:$G$20,5,0)","v":{"v":137,"d":"137.00"}},"5A"]
["F.01U.360.729","EWE-FPDVC-IW","12 msc. rozszrzenie gwarancji na moduł wej./wyj.",{"v":14,"d":"14.00"},{"$f":"VLOOKUP(A8,'Warranty Extension'!$B$3:$G$20,5,0)","v":{"v":17,"d":"17.00"}},"5A"]
["F.01U.360.730","EWE-LSN1500-IW","12 msc. rozszrzenie gwarancji na moduł LSN1500",{"v":85,"d":"85.00"},{"$f":"VLOOKUP(A9,'Warranty Extension'!$B$3:$G$20,5,0)","v":{"v":103,"d":"103.00"}},"5A"]
["F.01U.360.731","EWE-FPA5MD-IW","12 msc. rozszrzenie gwarancji na moduł centrali FPA",{"v":28,"d":"28.00"},{"$f":"VLOOKUP(A10,'Warranty Extension'!$B$3:$G$20,5,0)","v":{"v":34,"d":"34.00"}},"5A"]
["F.01U.360.733","EWE-FAP520-IW","12 msc. rozszrzenie gwarancji na czujnik FAP520",{"v":28,"d":"28.00"},{"$f":"VLOOKUP(A11,'Warranty Extension'!$B$3:$G$20,5,0)","v":{"v":34,"d":"34.00"}},"5A"]
["F.01U.360.735","EWE-FPC500-IW","12 msc. rozszrzenie gwarancji na centralę FPC-500",{"v":57,"d":"57.00"},{"$f":"VLOOKUP(A12,'Warranty Extension'!$B$3:$G$20,5,0)","v":{"v":69,"d":"69.00"}},"5A"]
["F.01U.360.736","EWE-FPTDT-IW","12 msc. rozszrzenie gwarancji na czujkę FAP-425",{"v":14,"d":"14.00"},{"$f":"VLOOKUP(A13,'Warranty Extension'!$B$3:$G$20,5,0)","v":{"v":17,"d":"17.00"}},"5A"]
["F.01U.360.742","EWE-UPS2416-IW","12 msc. rozszrzenie gwarancji na UPS2426 zasilacz centrali",{"v":57,"d":"57.00"},{"$f":"VLOOKUP(A14,'Warranty Extension'!$B$3:$G$20,5,0)","v":{"v":69,"d":"69.00"}},"5A"]
["F.01U.360.765","EWE-AVIOTEC-IW","12 msc. rozszrzenie gwarancji na Aviotec starlight 8000",{"v":922,"d":"922.00"},{"$f":"VLOOKUP(A15,'Warranty Extension'!$B$3:$G$20,5,0)","v":{"v":1117,"d":"1117.00"}},"5A"]

{"sheet":"Uwagi Ogólne","index":4,"n_rows":47,"n_cols":6,"rows_kept":47,"merged":[[2,0,2,8],[3,0,3,8],[15,1,20,8],[34,3,34,4],[34,5,34,6],[35,2,37,2],[35,3,35,4],[35,5,35,6],[36,3,37,4],[36,5,36,6],[37,5,37,6],[38,2,40,2],[38,3,38,4],[38,5,38,6],[39,3,40,4],[39,5,39,6],[40,5,40,6],[41,2,42,2],[41,3,41,4],[41,5,41,6],[42,3,42,4],[42,5,42,6],[43,3,43,4],[43,5,43,6],[44,3,44,4],[44,5,44,6],[45,2,46,2],[45,3,45,4],[45,5,45,6],[46,3,46,4],[46,5,46,6]]}
[]
["Wyjaśnienia dotyczące cenników. Opisane tematy:"]
["- Gwarancja"]
["- Klasyfikacja 1- A-B-C"]
[]
[null,"Na czerwono oznaczono produkty nowe. "]
[null,"Na niebiesko oznaczono produkty których cena uległa zmianie. "]
[null,"Na szaro produkty wycofane z cennika "]
[]
[null,"Przy składaniu ofert na produkty zawarte w cenniku należy zweryfikować czy produkt posiada aktualny certyfikat"]
[null,"Certyfikaty do pobrania pod produktami na stronie: www.boschsecurity.pl"]
[]
[]
[]
["Gwarancja"]
[null,"Okres gwarancji zależy od kategori produktu:  produkty Bosch (gwarancja - 5 lat), produkty handlowe i AVIOTEC (gwarancja - 3 lata) oraz baterie (gwarancja - 1 rok).\nW cenniku w kolumnie J znajdziesz odpowiedni okres gwarancji dla każdego produktu. Gwarancja liczona jest automatycznie od daty wystawienia faktury. Szczegóły znajdują się w ogólnych warunkach gwarancji dostępnych na stronie internetowej: https://www.boschsecurity.com/pl/wsparcie-techniczne/obsluga-posprzedazna/warranty/"]
[]
[]
[]
[]
[]
["Klasyfikacja 1-A-B-C "]
[]
[null,"Wprowadzenie"]
[null,"Wszystkie elementy są kategoryzowane do klasy 1, A, B lub C. Produkty 1, A i B są z zasady w magazynie, produkty C "]
[null,"produkowane na zamówienie i dlatego potrzebują nieco czasu. Zamówienia należy składać z klasyfikacją ABC."]
[null,"Klasyfikacja ta (z czasami oczekiwania) zostanie opublikowana w cenniku. W ten sposób klasyfikacja będzie "]
[null,"znana w całym łańcuchu dostaw (od fabryki po klienta). Ostateczna odpowiedzialność za klasyfikację ABC "]
[null,"spoczywa na menedżerze wspomagania sprzedaży (Sales Support Manager)."]
[]
[null,"Definicja"]
[null,"Poziom usług (RLIP=Requested Line Item Performance) na klase ABC i kryteria klasyfikacji produktu jako "]
[null,"1, A, B lub C są następujące:"]
[]
[null,null,"Klasa","Poiom usług",null,"Kryteria"]
[null,null,1,"·       Element magazynowy",null,"·       Produkt o wysokim i stosunkowo stabilnym popycie"]
[{"$nulls":3},"·       98% dostępnych z magazynu, w innych przypadkach należy poczekać",null,"·       Produkty sprzedawane głównie przez hurtownie"]
[{"$nulls":5},"·       Produkty, które ‘dopełniają’  pakiet (np. łączniki)"]
[null,null,"A","·       Element magazynowy",null,"·       Produkt o wysokim i stosunkowo stabilnym popycie"]
[{"$nulls":3},"·       95% dostępnych z magazynu, w innych przypadkach należy poczekać",null,"·       Produkty sprzedawane głównie przez hurtownie"]
[{"$nulls":5},"·       Produkty, które ‘dopełniają’  pakiet (np. łączniki)"]
[null,null,"B","·       Element magazynowy",null,"·   Produkty o rozsądnej, ale wysoce nieprzewidywalnej strukturze popytu."]
[{"$nulls":3},"·       90% dostępnych z magazynu, w innych przypadkach należy poczekać",null,"·   Produkty sprzedawane przez kanał VAR "]
[null,null,"C","Element produkowany na zamówienie",null,"·   Produkty o niskiej i nieprzewidywalnej strukturze popytu"]
[null,null,"(C1/C2)",null,null,"·   Produkty dostosowane do klienta"]
[null,null,"D","Elementy produkowane na zamowienie ",null,"Produkty bez przewidywalnego zapotrzebowania i czasu produkcji "]
[{"$nulls":3},"Czas realizacji określany indywidualnie do każdego zamówienia ",null,"Produkty projektowane według zamówienia klienta "]

{"sheet":"Fire EN 54_old","index":5,"n_rows":503,"n_cols":19,"rows_kept":503,"hidden":true}
["Change Indicator",null,"BU Fire reference REUP List Q1-2 / 2025  -   V1.3",{"$nulls":3},"Note: Warranty extension available on demand for specific products"]
[null,"12 NC","CTN","SAPnumber","Description","Discount Category","REUP EMEA valid 01.06.2025","REUP PL valid 01.06.2025","Warranty Extension","Status","ABC Code","HS Code","Country of Origin","Spike order","Net weight \n(kg)","Order Info","Repair process","Remarks","EAN code single"]
[null,"Modular Panel"]
[null,"Modules FPA-5000 and AVENAR Panels"]
[null,"7050 000 81384","BCM-0000-B","F.01U.081.384","BCM 0000 B  Battery Controller Module","5A",211.69,{"$f":"ROUND(ROUND(G5*4.8,2),0)","v":{"v":1016,"d":"1,016.00"}},"on demand","C",1,8537109199,"CN",148,"0.342",null,"SBN",null,800549180153]
[null,"6649 981 37262","ANI 0016 A","4.998.137.262","ANI 0016 A  16 Point Annunciator internal","5A",127.02,{"$f":"ROUND(ROUND(G6*4.8,2),0)","v":{"v":610,"d":"610.00"}},"on demand","C","A",8537109199,"CN",7,"0.26",null,"SBN",null,8717332205882]
[null,"6649 981 37265","RML 0008 A","4.998.137.265","RML 0008 A  Relay Low Voltage","5A",169.34,{"v":813,"d":"813.00"},"on demand","C",1,8537109199,"CN",98,"0.306",null,"SBN",null,8717332205912]
[null,"6649 981 37266","IOS 0020 A","4.998.137.266","IOS 0020 A  20mA Communication Module","5A",254.03,{"v":1219,"d":"1,219.00"},"on demand","C",1,8537109199,"CN",15,"0.594",null,"SBN",null,8717332205929]
[null,"6649 981 37267","IOS 0232 A","4.998.137.267","IOS 0232 A  RS232 Communication Module","5A",254.03,{"v":1219,"d":"1,219.00"},"on demand","C","A",8537109199,"CN",4,"0.233",null,"SBN",null,8717332205936]
[null,"6649 981 37269","IOP 0008 A","4.998.137.269","IOP 0008 A  8 input/output OC module","5A",232.51,{"v":1116,"d":"1,116.00"},"on demand","C",1,8537109199,"CN",17,"0.299",null,"SBN",null,8717332205943]
[null,"6649 981 37270","CZM 0004 A","4.998.137.270","CZM 0004 A  4 Zone Conventional Zone Module","5A",459.06,{"v":2203,"d":"2,203.00"},"on demand","C",1,8537109199,"CN",52,"0.333",null,"SBN",null,8717332205950]
[null,"7050 000 63204","ENO 0000 B","F.01U.063.204","ENO 0000 B (External Notification)","5A",{"v":338.7,"d":"338.70"},{"v":1626,"d":"1,626.00"},"on demand","C",1,8537109199,"CN",79,"0.27",null,"SBN",null,800549134231]
[null,"6649 981 37274","RMH 0002 A","4.998.137.274","RMH 0002 A  2 Zone Relay high voltage","5A",387.52,{"v":1860,"d":"1,860.00"},"on demand","C","A",8537109199,"CN",15,"0.31",null,"SBN",null,8717332205998]
[null,"6649 981 37275","NZM 0002 A","4.998.137.275","NZM 0002 A  2 Zone NAC Zone Module","5A",{"v":338.7,"d":"338.70"},{"v":1626,"d":"1,626.00"},"on demand","C",1,8537109199,"CN",37,"0.306",null,"SBN",null,8717332206001]
[null,"6650 000 28289","FPE-5000-UGM","F.01U.028.289","UGM interface module","5A",447.07,{"v":2146,"d":"2,146.00"},"no W-Extension","C","A",8537109199,"CN",32,"0.27",null,"SBN",null,8717332260041]
[null,"6649 981 37277","LSN 0300 A","4.998.137.277","LSN 0300 A  LSN Module","5A",494.82,{"v":2375,"d":"2,375.00"},"on demand","C",1,8538909999,"CN",462,"0.306",null,"SBN",null,8717332206018]
[null,"6649 981 37278","LSN 1500 A","4.998.137.278","LSN 1500 A, LSN improved Module","5A",983.69,{"v":4722,"d":"4,722.00"},"on demand","C","A",8538909999,"CN",27,"0.68",null,"SBN",null,8717332309719]
[null,"6649 981 37279","PRS-0002-C","F.01U.284.903","PRS-0002-C  Panel Rail Short","5A",57.43,{"v":276,"d":"276.00"},"no W-Extension","C","A",8536901000,"CN",165,"0.45",null,"SBN",null,8717332206025]
[null,"6649 981 37280","PRD 0004 A","4.998.137.280","PRD 0004 A  Panel Rail long","5A",143.95,{"v":691,"d":"691.00"},"no W-Extension","C",1,8536901000,"CN",129,"0.72",null,"SBN",null,8717332206032]
[null,"AVENAR Panel 8000 ",null,"",{"$nulls":4},"",{"$nulls":4},"",""]
[null,"7050 003 27090","FPE-8000-SPC","F.01U.327.090","Panel controller, standard license","5A",822.73,{"$f":"ROUND(ROUND(G21*4.8,2),0)","v":{"v":3949,"d":"3,949.00"}},"on demand","C","A",8537109199,"PT",24,3.191,null,"SBN",null,8717332940417]
[null,"7050 003 52441","FPE-8000-PPC","F.01U.352.441","Panel controller, premium license","5A",{"v":1412.94,"d":"1,412.94"},{"$f":"ROUND(ROUND(G22*4.8,2),0)","v":{"v":6782,"d":"6,782.00"}},"on demand","C","A",8537109199,"PT",27,3.191,null,"SBN",null,4060039031174]
[null,"Housings for Frame Installation AVENAR Panel 8000",null,"",{"$nulls":4},"",{"$nulls":4},"",""]
[null,"6649 981 37290","CPH 0006 A","4.998.137.290","CPH 0006 A  Backbox CABT 1 rail","5A",504.01,{"$f":"ROUND(ROUND(G24*4.8,2),0)","v":{"v":2419,"d":"2,419.00"}},"no W-Extension","C",1,8538909999,"CN",68,"12.34",null,"SBN",null,8717332206131]
[null,"6649 981 37291","MPH 0010 A","4.998.137.291","MPH 0010 A  Backbox CABT 2 Rails","5A",635.05,{"$f":"ROUND(ROUND(G25*4.8,2),0)","v":{"v":3048,"d":"3,048.00"}},"no W-Extension","C",1,8538909999,"CN",74,"13.85",null,"SBN",null,8717332206148]
[null,"6649 981 37292","EPH 0012 A","4.998.137.292","EPH 0012 A  Backbox 3 rails","5A",{"v":1079.08,"d":"1,079.08"},{"v":5180,"d":"5,180.00"},"no W-Extension","C",1,8538909999,"CN",21,"14.55",null,"SBN",null,8717332206155]
[null,"6649 981 37293","PSF 0002 A","4.998.137.293","PSF 0002 A  Power-small-frame","5A",340.52,{"v":1635,"d":"1,635.00"},"no W-Extension","C",1,8538909999,"CN",54,"7.723",null,"SBN",null,8717332206162]
[null,"6650 005 11306","PMF 0002 A","F.01U.511.306","PMF 0002 A  Power-medium-frame","5A",343.53,{"v":1649,"d":"1,649.00"},"no W-Extension","C","A",3926909790,"CN",124,"12.726",null,"SBN",null,8717332206667]
[null,"6649 981 37294","PMF 0004 A","4.998.137.294","PMF 0004 A  Power-medium-frame","5A",393.67,{"v":1890,"d":"1,890.00"},"no W-Extension","C",1,8538909999,"CN",64,"12.132",null,"SBN",null,8717332206179]
[null,"6649 981 47119","USF 0000 A","4.998.147.119","USF 0000 A  Universal housing-small-frame","5A",327.61,{"v":1573,"d":"1,573.00"},"no W-Extension","C","A",8538909999,"CN",13,"7.489",null,"SBN",null,8717332206315]
[null,"6649 981 37296","FBH 0000 A","4.998.137.296","FBH 0000 A  Mounting frame large","5A",171.37,{"v":823,"d":"823.00"},"no W-Extension","C",1,3926909790,"CN",500,"4.822",null,"SBN",null,8717332206193]
[null,"6649 981 37297","FMH 0000 A","4.998.137.297","FMH 0000 A  Mounting frame medium","5A",{"v":126,"d":"126.00"},{"v":605,"d":"605.00"},"no W-Extension","C",1,3926909790,"CN",150,"4.137",null,"SBN",null,8717332206209]
[null,"6649 981 37298","FSH 0000 A","4.998.137.298","FSH 0000 A  Mounting frame small","5A",100.81,{"v":484,"d":"484.00"},"no W-Extension","C","A",3926909790,"CN",20,"2.362",null,"SBN",null,8717332206216]
[null,"7050 002 66845","FPM-5000-KMC","F.01U.266.845","mounting kit for media converter","5A",425.92,{"v":2044,"d":"2,044.00"},"no W-Extension","C","A",85189000,"DE",7,"0.86",null,"SBN",null,8717332875269]
[null,"6650 005 11305","HMP 0003 A","F.01U.511.305","HMP 0003 A, installation plate for mounting frame","5A",127.02,{"v":610,"d":"610.00"},"no W-Extension","C","A",3926909790,"CN",8,"0.383",null,"SBN",null,8717332206650]
[null,"6649 981 39498","FRB 0019 A","4.998.139.498","FRB 0019 A  19\" Frame Rack X Rails","5A",135.48,{"v":650,"d":"650.00"},"no W-Extension","C","A",7326909890,"CN",10,"4.813",null,"SBN",null,8717332206278]
[null,"6649 981 39499","FRM 0019 A","4.998.139.499","FRM 0019 A  19\" Frame Rack X Rails","5A",105.84,{"v":508,"d":"508.00"},"no W-Extension","C","A",7326909890,"CN",4,"4.778",null,"SBN",null,8717332206285]
[null,"6649 981 39500","FRS 0019 A","4.998.139.500","FRS 0019 A  19\" Frame Rack X Rails","5A",93.14,{"v":447,"d":"447.00"},"no W-Extension","C","A",3926909790,"CN",3,"3.14",null,"SBN",null,8717332206292]
[null,"6650 005 00374","FDP 0001 A","F.01U.500.374","FDP 0001 A    Front Dummy cover plate","5A",16.93,{"v":81,"d":"81.00"},"no W-Extension","C",1,3926909790,"CN",737,"0.1",null,"SBN",null,8717332206605]
[null,"6650 005 13251","FPO-5000-EB","F.01U.513.251","FPO-5000-EB earth bar ","5A",84.68,{"v":406,"d":"406.00"},"no W-Extension","C","A",7326909890,"CN",31,"0.111",null,"SBN",null,8717332206766]
[null,"Housings for Wall Mounting AVENAR Panel 8000",null,"",{"$nulls":4},"",{"$nulls":4},"",""]
[null,"6649 981 37285","HCP 0006 A","4.998.137.285","HCP 0006 A  CABT 1 Rail & Common Control","5A",423.37,{"$f":"ROUND(ROUND(G42*4.8,2),0)","v":{"v":2032,"d":"2,032.00"}},"no W-Extension","C",1,8529904900,"CN",64,"13.581",null,"SBN",null,8717332206087]
[null,"6649 981 37286","HBC 0010 A","4.998.137.286","HBC 0010 A  CABT 2 Rails & Common Control","5A",635.05,{"$f":"ROUND(ROUND(G43*4.8,2),0)","v":{"v":3048,"d":"3,048.00"}},"no W-Extension","C",1,8529904900,"CN",13,"17.11",null,"SBN",null,8717332206094]
[null,"6649 981 37287","HBE 0012 A","4.998.137.287","HBE 0012 A  CABT 3 Rails","5A",{"v":1079.08,"d":"1,079.08"},{"v":5180,"d":"5,180.00"},"no W-Extension","C","A",8529904900,"CN",7,"18.144",null,"SBN",null,8717332206100]
[null,"6649 981 37288","PSS 0002 A","4.998.137.288","PSS 0002 A  CABT 1 power Slot 2 batterys","5A",468.02,{"v":2247,"d":"2,247.00"},"no W-Extension","C","A",3926909790,"CN",8,"7.452",null,"SBN",null,8717332206117]
[null,"6649 981 37289","PSB 0004 A","4.998.137.289","PSB 0004 A  CABT 1 power Slot 4 batterys","5A",635.05,{"v":3048,"d":"3,048.00"},"no W-Extension","C","A",3926909790,"CN",10,"12.511",null,"SBN",null,8717332206124]
[null,"6650 005 11304","FRK 0019 A","F.01U.511.304","FRK 0019 A 19 inches fixing kit","5A",281.85,{"v":1353,"d":"1,353.00"},"no W-Extension","C","A",7326909890,"DE",1,"2.34",null,"SBN",null,8717332263493]
[null,"7050 002 66844","FPM-5000-KES","F.01U.266.844","FPM-5000-KES mounting kit for Ethernet switch","5A",751.61,{"v":3608,"d":"3,608.00"},"no W-Extension","C","A",8302500000,"DE",5,"2.77",null,"SBN",null,8717332875252]
[null,"7050 002 65641","EL1141-10B-BH","F.01U.265.641","EL1141-10B-BH Ethernet Fibre Optics Converter MM","5A",{"v":907.8,"d":"907.80"},{"v":4357,"d":"4,357.00"},"no W-Extension","C","A",8504409090,"TW",31,"0.58",null,"SBN",null,8717332871018]
[null,"7050 002 65643","EL1141-B0B-BH","F.01U.265.643","EL1141-10B-BH Ethernet Fibre Optics Converter SM","5A",{"v":1261.33,"d":"1,261.33"},{"v":6054,"d":"6,054.00"},"no W-Extension","C","A",8504409090,"TW",23,"0.58",null,"SBN",null,8717332871032]
[null,"Power Supplies AVENAR Panel 8000",{"$nulls":6},"",{"$nulls":4},"",""]
[null,"6650 005 00367","UPS 2416 A","F.01U.500.367","UPS 2416 Power Supply 24V/6A NAC sync","5A",{"v":414.9,"d":"414.90"},{"$f":"ROUND(ROUND(G52*4.8,2),0)","v":{"v":1992,"d":"1,992.00"}},"on demand","C",1,8504403090,"CN",1250,"0.97",null,"SBN",null,8717332206582]
[null,"6649 981 53243","CPB 0000 A","4.998.153.243","CPB 0000 A  Cable set P-Supply to BC ","5A",21.17,{"$f":"ROUND(ROUND(G53*4.8,2),0)","v":{"v":102,"d":"102.00"}},"no W-Extension","C","A",8544429090,"CN",700,"0.198",null,"SBN",null,8717332206520]
[null,"7050 000 78858","FPO-5000-PSB1","F.01U.078.858","PSB 1001 A  P-Supply Bracket US single ","5A",93.14,{"v":447,"d":"447.00"},"no W-Extension","C","A",3926909790,"CN",12,"1.03",null,"SBN",null,8717332342655]
[null,"7050 000 78860","FPO-5000-PSB-CH","F.01U.078.860","CPB 1002 A  P-Supply Bracket CH US","5A",118.55,{"v":569,"d":"569.00"},"no W-Extension","C",1,3926909790,"CN",375,"0.798",null,"SBN",null,8717332342679]
[null,705000398453,"FPP-3000","F.01U.398.453","Power Supply","5A",572.12,{"v":2746,"d":"2,746.00"},"no W-Extension","C","A",85044055,"PL",23,{"v":11,"d":"11.000"},null,"SBN",null,4060039146991]
[null,"6650 005 11307","FPP 5000","F.01U.511.307","FPP 5000, AUX power supply kit","5A",{"v":1151.56,"d":"1,151.56"},{"v":5527,"d":"5,527.00"},"no W-Extension","C","B",8504900500,"NL",20,"20.7",null,"RC",null,8717332206674]
[null,"7050 001 61679","FPP-5000-TI13","F.01U.161.679","LSN interface for FPP-5000","5A",{"v":171,"d":"171.00"},{"v":821,"d":"821.00"},"on demand","C","A",8531900000,"CN",111,"0.306",{"$nulls":3},8717332754281]
[null,"Cable Sets FPA-5000 / AVENAR Panel 8000",{"$nulls":6},"",{"$nulls":4},"",""]
[null,"6649 981 53244","CBB 0000 A","4.998.153.244","CBB 0000 A  Cable set BC to Battery","5A",27.52,{"$f":"ROUND(ROUND(G60*4.8,2),0)","v":{"v":132,"d":"132.00"}},"no W-Extension","C",1,8544429090,"CN",788,"0.198",null,"SBN",null,8717332206537]
[null,"7050 003 49391","FPE-8000-CRP","F.01U.349.391","Cable set redundant panel controller","5A",71.54,{"$f":"ROUND(ROUND(G61*4.8,2),0)","v":{"v":343,"d":"343.00"}},"no W-Extension","C","A",8544429090,"PT",13,0.642,null,"SBN",null,4060039022608]
[null,"7050 003 49392","FPE-8000-CRK","F.01U.349.392","Cable redundant keypad","5A",42.92,{"v":206,"d":"206.00"},"no W-Extension","C","A",8544429090,"PT",25,0.258,null,"SBN",null,4060039022615]
[null,"Display Panels",{"$nulls":6},"",{"$nulls":4},"",""]
[null,"6649 980 00922","BAT 100 LSN","4.998.000.922","BAT100 LSN, Remote display panel","5A",{"v":566.5,"d":"566.50"},{"$f":"ROUND(ROUND(G64*4.8,2),0)","v":{"v":2719,"d":"2,719.00"}},"on demand","C","A",8537109199,"DE",3,"2.61",null,"SBN","One ATG-420-LSNi is included",8717332004584]
[null,8717332915347,"ATB 420 LSNi","F.01U.284.611","ATB 420 LSNi for the connection to location map tableaus","5A",346.34,{"$f":"ROUND(ROUND(G65*4.8,2),0)","v":{"v":1662,"d":"1,662.00"}},"on demand","C","A",8538909189,"DE",11,"0.07",null,"SBN",null,8717332915347]
[null,"6649 980 01941","BAT100-LABELS","4.998.001.941","BS labeling strips for BAT 100","5A",{"v":85.5,"d":"85.50"},{"v":410,"d":"410.00"},"no W-Extension","C","C",3919908099,"DE",2,"0.266",null,"SBN",null,8717332019816]
[null,8531901000,"ATG 420 LSNI","F.01U.284.610","ATG 420 LSNi display module","5A",346.34,{"v":1662,"d":"1,662.00"},"on demand","C","C",8531209590,"CN",9,"0.055",null,"SBN",null,8717332915330]
[null,"not in MFG","ATG100-LABEL","3.902.102.662","BS labeling membranes ATG 100","5A",46.04,{"v":221,"d":"221.00"},"no W-Extension","C","C",3919908099,"DE",10,"0.349",null,"-",null,""]
[null,"Accessories FPA-5000 / AVENAR Panel 8000",{"$nulls":6},"",{"$nulls":4},""]
[null,"6650 005 00374","FDP 0001 A","F.01U.500.374","FDP 0001 A    Front Dummy cover plate","5A",16.93,{"$f":"ROUND(ROUND(G70*4.8,2),0)","v":{"v":81,"d":"81.00"}},"no W-Extension","C",1,3926909790,"CN",737,"0.1",null,"SBN",null,8717332206605]
[null,"6650 005 00442","SIV 28","F.01U.500.442","SIV 28V Fuse protected distributor           ","5A",115.56,{"$f":"ROUND(ROUND(G71*4.8,2),0)","v":{"v":555,"d":"555.00"}},"no W-Extension","C","A",8531900000,"DE",5,"0.22",null,"SBN",null,8717332212309]
[null,null,"ESP-EF01U390166","F.01U.390.166","SPA Cable NTC-Resistor Magic-Panel","5A",57.48,{"v":276,"d":"276.00"},"no W-Extension","C","A",85334010,"China",null,"0.001",null,"No repair",null,4060039122308]
[null,"Remote Keypad for AVENAR Panel Series",null,"",{"$nulls":4},"",{"$nulls":4},"",""]
[null,"7050 003 27092","FPE-8000-FMR","F.01U.327.092","Remote Keypad","5A",{"v":1448.71,"d":"1,448.71"},{"$f":"ROUND(ROUND(G74*4.8,2),0)","v":{"v":6954,"d":"6,954.00"}},"on demand","C","A",8537109199,"PT",22,3.121,null,"SBN",null,8717332940431]
[null,"AVENAR Panel 2000 Series",null,"",{"$nulls":4},"",{"$nulls":4},"",""]
[null,"7050 003 27091","FPE-2000-SPC","F.01U.327.091","Panel controller AVENAR panel 2000, standard license","5A",822.73,{"$f":"ROUND(ROUND(G76*4.8,2),0)","v":{"v":3949,"d":"3,949.00"}},"on demand","C","A",8537109199,"PT",28,3.191,null,"SBN",null,8717332940424]
[null,"7050 003 52443","FPE-2000-PPC","F.01U.352.443","Panel controller AVENAR panel 2000, premium license","5A",{"v":1412.94,"d":"1,412.94"},{"$f":"ROUND(ROUND(G77*4.8,2),0)","v":{"v":6782,"d":"6,782.00"}},"on demand","C","A",8537109199,"PT",18,3.191,null,"SBN",null,4060039031181]
[null,"7050 003 83886","FPA-2000-SWM","F.01U.383.886","Panel kit standard license, wall-mount","5A",{"v":1721.76,"d":"1,721.76"},{"$f":"ROUND(ROUND(G78*4.8*1.05,2),0)","v":{"v":8678,"d":"8,678.00"}},"no W-Extension","C","A",8537109199,"PT",0,19.7,null,"SBN",null,4060039107411]
[null,"7050 003 83887","FPA-2000-SFM","F.01U.383.887","Panel kit standard license, frame-mount","5A",{"v":1851.22,"d":"1,851.22"},{"$f":"ROUND(ROUND(G79*4.8*1.05,2),0)","v":{"v":9330,"d":"9,330.00"}},"no W-Extension","C","A",8537109199,"PT",5,22.8,null,"SBN",null,4060039107428]
[null,"7050 003 83888","FPA-2000-PWM","F.01U.383.888","Panel kit premium license, wall-mount","5A",{"v":2258.95,"d":"2,258.95"},{"$f":"ROUND(ROUND(G80*4.8*1.05,2),0)","v":{"v":11385,"d":"11,385.00"}},"no W-Extension","C","A",8537109199,"PT",0,19.7,null,"SBN",null,4090039107435]
[null,"7050 003 83893","FPA-2000-PFM","F.01U.383.893","Panel kit premium license, frame-mount","5A",{"v":2382.72,"d":"2,382.72"},{"$f":"ROUND(ROUND(G81*4.8*1.05,2),0)","v":{"v":12009,"d":"12,009.00"}},"no W-Extension","C","A",8537109199,"PT",2,22.8,null,"SBN",null,4060039107442]
[null,"BACNet Server License",{"$nulls":6},"",{"$nulls":4},""]
["2025-05-07","7050 004 28678","FSM8000-BNSL","F.01U.428.678","BACnet server license 5 years","n.a.",{"v":2000,"d":"2,000.00"},{"$f":"ROUND(ROUND(G83*4.8,2),0)","v":{"v":9600,"d":"9,600.00"}},"no W-Extension",null,"C","n.a.","DE",null,"n.a.",null,"n.a.","Available as of 01.06.2025",4060039205827]
["2025-05-07","7051 004 28679","FSM8000-BNSTL","F.01U.428.679","BACnet server trial license 30 days","n.a.",{"v":45,"d":"45.00"},{"$f":"ROUND(ROUND(G84*4.8,2),0)","v":{"v":216,"d":"216.00"}},"no W-Extension",null,"C","n.a.","DE",null,"n.a.",null,"n.a.","Available as of 01.06.2025",4060039205834]
[null,"Remote Serive",{"$nulls":6},"",{"$nulls":4},""]
["2025-05-07","n.a.","FPO-GATE","F.01U.433.333","Secure Network Gateway","5A",{"v":937.5,"d":"937.50"},{"$f":"ROUND(ROUND(G86*4.8,2),0)","v":{"v":4500,"d":"4,500.00"}},"no W-Extension","C","A",8517620000,"DE",null,1.127,null,null,"Available as of 15.06.2025 the latest",4060039034250]
["2025-05-07","n.a.","FSL-BASIC-S","F.01U.435.428","NEXOSPACE FSE basic license S","5A",593.75,{"$f":"ROUND(ROUND(G87*4.8,2),0)","v":{"v":2850,"d":"2,850.00"}},"no W-Extension","C","n.a.",4911990000,"DE",null,0,"Annual connectivity license <254 points","No physical product","Available as of 01.06.2025",4060039104076]
["2025-05-07","n.a.","FSL-BASIC-M","F.01U.435.594","NEXOSPACE FSE basic license M","5A",{"v":1531.25,"d":"1,531.25"},{"v":7350,"d":"7,350.00"},"no W-Extension","C","n.a.",4911990000,"DE",null,0,"Annual connectivity license 254 - 2000 points","No physical product","Available as of 01.06.2025",4060039112699]
["2025-05-07","n.a.","FSL-BASIC-L","F.01U.435.590","NEXOSPACE FSE basic license L","5A",{"v":3750,"d":"3,750.00"},{"v":18000,"d":"18,000.00"},"no W-Extension","C","n.a.",4911990000,"DE",null,0,"Annual connectivity license > 2000 points","No physical product","Available as of 01.06.2025",4060039111692]
["2025-05-07","7050 003 09110","FPA-REMOTE-GATEWAY","F.01U.360.934","Secure Network Gateway","5A",770.65,{"$f":"ROUND(ROUND(G90*4.8,2),0)","v":{"v":3699,"d":"3,699.00"}},"no W-Extension","C","A",8517620000,"DE",3,"0.87",null,null,"Stopp of sales and delivery by 01.06.2025",8717332977307]
[null,"Fire Monitoring System",null,"",{"$nulls":4},"",{"$nulls":4},"",""]
[null,"7050 003 14991","FSM-5000","F.01U.314.991","Fire Monitoring System 5000","5A",{"v":5122.49,"d":"5,122.49"},{"$f":"ROUND(ROUND(G92*4.8,2),0)","v":{"v":24588,"d":"24,588.00"}},"no W-Extension","C","C",4911990000,"IT",{"v":0,"d":"0.000"},"0.001","Sold only in SEO. Outphased  for rest EMEA","No repair","Sold only in SEO. Outphased  for rest EMEA",8717332995257]
[null,"7050 003 14990","FSM-2500","F.01U.314.990","Fire Monitoring System 2500","5A",{"v":3472.88,"d":"3,472.88"},{"$f":"ROUND(ROUND(G93*4.8,2),0)","v":{"v":16670,"d":"16,670.00"}},"no W-Extension","C","C",4911990000,"IT",0,"0.001","Sold only in SEO. Outphased  for rest EMEA","No repair","Sold only in SEO. Outphased  for rest EMEA",8717332995240]
[null,null,"FSM-10K","F.01U.374.278","Fire Monitoring System 10000","5A",{"v":9261,"d":"9,261.00"},{"v":44453,"d":"44,453.00"},"no W-Extension","C","C",4911990000,"IT","","0.001","Cannot be sold in SEO","No repair","Cannot be sold in SEO",4060039091192]
[null,null,"FSM-5000","F.01U.374.695","Fire Monitoring System 5000","5A",{"v":5122.49,"d":"5,122.49"},{"v":24588,"d":"24,588.00"},"no W-Extension","C","C",4911990000,"IT",{"v":0,"d":"0.000"},"0.001","Cannot be sold in SEO","No repair","Cannot be sold in SEO",4060039091437]
[null,null,"FSM-2500","F.01U.374.694","Fire Monitoring System 2500","5A",{"v":3472.88,"d":"3,472.88"},{"v":16670,"d":"16,670.00"},"no W-Extension","C","C",4911990000,"IT",{"v":0,"d":"0.000"},"0.001","Cannot be sold in SEO","No repair","Cannot be sold in SEO",4060039091420]
[null,"7050 003 14992","FSM-5000-EP","F.01U.314.992","Evolution pack FSM-5000","5A",499.86,{"v":2399,"d":"2,399.00"},"no W-Extension","C","C",4911990000,"IT",0,"0.001",null,"No repair",null,8717332995264]
[null,"7050 003 15067","FSM-2500-EP","F.01U.315.067","Evolution pack FSM-2500","5A",349.05,{"v":1675,"d":"1,675.00"},"no W-Extension","C","C",4911990000,"IT",0,"0.001",null,"No repair",null,8717332995288]
[null,"Conventional panels",null,"",{"$nulls":4},"",{"$nulls":4},"",""]
[null,705000164791,"FPC-500-2","F.01U.164.791","2 zone conventional fire panel","5A",381.77,{"$f":"ROUND(ROUND(G100*4.8,2),0)","v":{"v":1833,"d":"1,833.00"}},"on demand","C","A",8531103000,"CN",15,"2.2",{"$nulls":3},8717332759385]
[null,705000164792,"FPC-500-4","F.01U.164.792","4 zone conventional fire panel","5A",470.55,{"$f":"ROUND(ROUND(G101*4.8,2),0)","v":{"v":2259,"d":"2,259.00"}},"on demand","C","A",8531103000,"CN",20,"3.456",{"$nulls":3},8717332759392]
[null,705000164793,"FPC-500-8","F.01U.164.793","8 zone conventional fire panel","5A",588.93,{"v":2827,"d":"2,827.00"},"on demand","C","A",8531103000,"CN",14,"3.42",{"$nulls":3},8717332759408]
[null,705000164794,"FPC-500-OCEXT","F.01U.164.794","Optional open collector board","5A",{"v":44.4,"d":"44.40"},{"v":213,"d":"213.00"},"no W-Extension","C","A",8531900000,"CN",1,"0.1",{"$nulls":3},8717332759415]
[null,705000164795,"FPC-500-RLYEXT","F.01U.164.795","Optional relay board","5A",82.86,{"v":398,"d":"398.00"},"no W-Extension","C","A",8531900000,"CN",10,"0.1",{"$nulls":3},8717332759422]
[null,705000164844,"FPC-500-KEY","F.01U.164.844","Optional access key level 2","5A",{"v":29.6,"d":"29.60"},{"v":142,"d":"142.00"},"no W-Extension","C","A",3926909790,"CN",8,"0.01",{"$nulls":3},8717332759859]
[null,"Batteries",null,"",{"$nulls":4},"","",null,null,""]
[null,"Batteries ",null,"",{"$nulls":4},"","",null,null,""]
[null,null,"IPS-BAT12V-12AH","F.01U.579.778","Battery 12 V / 10 - 12 Ah",null,"Purchase via BU SC",{"$nulls":7},"3.730"]
[null,null,"IPS-BAT12V-27AH","F.01U.579.781","Battery 12 V / 24 - 27 Ah",null,"Purchase via BU SC",{"$nulls":7},"7.96"]
[null,null,"IPS-BAT12V-45AH","F.01U.579.782","Battery 12 V / 38 - 45 Ah",null,"Purchase via BU SC",{"$nulls":7},"13.520"]
[null,"LSN Detectors",null,"",{"$nulls":4},"",{"$nulls":4},"",""]
[null,"500 Series",null,"",{"$nulls":4},"",{"$nulls":4},"",""]
[null,"6650 005 10149","FAP-O 520","F.01U.510.149","FAP-O 520 opt smoke detector LSNi white","5A",197.17,{"$f":"ROUND(ROUND(G113*4.8,2),0)","v":{"v":946,"d":"946.00"}},"on demand","C","A",8531103000,"CN",112,"0.170",null,"SBN",null,8717332265121]
[null,"6650 005 10151","FAP-OC 520","F.01U.510.151","FAP-OC 520 Multisensor detector LSNi wh","5A",315.55,{"$f":"ROUND(ROUND(G114*4.8,2),0)","v":{"v":1515,"d":"1,515.00"}},"on demand","C","A",8531103000,"CN",23,"0.180",null,"SBN",null,8717332265138]
[null,"6650 005 10161","FAP-O 520-P","F.01U.510.161","FAP-O 520-P opt smoke detector LSNi tr","5A",223.47,{"v":1073,"d":"1,073.00"},"on demand","C","A",8531103000,"CN",20,"0.170",null,"SBN",null,8717332265190]
[null,"6650 005 10162","FAP-OC 520-P","F.01U.510.162","FAP-OC 520-P Multisens detector LSNi tr","5A",322.26,{"v":1547,"d":"1,547.00"},"on demand","C","A",8531103000,"CN",15,"0.180",null,"SBN",null,8717332265213]
[null,"AVENAR Detector 4000",null,"",{"$nulls":4},"",{"$nulls":4},"",""]
[null,"7050 003 07726","FAP-425-O-R","F.01U.307.726","Optical with Rotary-Switches","5A",87.23,{"$f":"ROUND(ROUND(G118*4.8*0.72,2),0)","v":{"v":301,"d":"301.00"}},"on demand","C","A",8531103000,"PT",12911,"0.077",null,"SBN",null,8717332972968]
[null,"7050 003 07728","FAP-425-OT-R","F.01U.307.728","Optical/Thermal with Rotary-Switches","5A",101.21,{"$f":"ROUND(ROUND(G119*4.8*0.72,2),0)","v":{"v":350,"d":"350.00"}},"on demand","C","A",8531103000,"PT",10961,"0.077",null,"SBN",null,8717332972982]
[null,"7050 003 07732","FAH-425-T-R","F.01U.307.732","Heat with Rotary-Switches","5A",79.47,{"$f":"ROUND(ROUND(G120*4.8*0.82,2),0)","v":{"v":313,"d":"313.00"}},"on demand","C","A",8531103000,"PT",1050,"0.077",null,"SBN",null,8717332973026]
[null,"7050 003 07729","FAP-425-DO-R","F.01U.307.729","Dual-Optical with Rotary-Switches","5A",94.27,{"$f":"ROUND(ROUND(G121*4.8*0.72,2),0)","v":{"v":326,"d":"326.00"}},"on demand","C","A",8531103000,"PT",2238,"0.077",null,"SBN",null,8717332972999]
[null,"7050 003 07730","FAP-425-DOT-R","F.01U.307.730","Dual-Optical/Thermal with Rotary-Switches","5A",109.17,{"$f":"ROUND(ROUND(G122*4.8*0.72,2),0)","v":{"v":377,"d":"377.00"}},"on demand","C","A",8531103000,"PT",2407,"0.077",null,"SBN",null,8717332973002]
[null,"7050 003 07731","FAP-425-DOTC-R","F.01U.307.731","Dual-Optical/Thermal/Chemical with Rotary-Switches","5A",182.43,{"$f":"ROUND(ROUND(G123*4.8*0.75,2),0)","v":{"v":657,"d":"657.00"}},"on demand","C","A",8531103000,"PT",275,"0.082",null,"SBN",null,8717332973019]
[null,"7050 003 95473","FAP-425-DOTCO-R","F.01U.395.473","Detector dual-optical/thermal/CO","5A",182.43,{"$f":"ROUND(ROUND(G124*4.8*0.75,2),0)","v":{"v":657,"d":"657.00"}},"on demand","C","A",8531103000,"PT",null,"0,082",null,"SBN",null,"4060039133199"]
[null,"7050 003 07725","FAP-425-O","F.01U.307.725","Optical without Rotary-Switches","5A",84.35,{"$f":"ROUND(ROUND(G125*4.8*0.72,2),0)","v":{"v":292,"d":"292.00"}},"on demand","C","A",8531103000,"PT",4365,"0.075",null,"SBN",null,8717332972951]
[null,"7050 003 07727","FAP-425-OT","F.01U.307.727","Optical/Thermal without Rotary-Switches","5A",99.11,{"$f":"ROUND(ROUND(G126*4.8*0.72,2),0)","v":{"v":343,"d":"343.00"}},"on demand","C","A",8531103000,"PT",1688,"0.075",null,"SBN",null,8717332972975]
[null,"Accessories 500/400/300 series detectors",null,"",{"$nulls":4},"",{"$nulls":4},"",""]
[null,"Accessories for FAP-500 Series",null,"",{"$nulls":4},"",{"$nulls":4},"",""]
[null,"6650 005 08713","FAA-500-CB","F.01U.508.713","FAA-500-CB, built-in housing for concrete ceiling","5A",{"v":70.8,"d":"70.80"},{"$f":"ROUND(ROUND(G129*4.8,2),0)","v":{"v":340,"d":"340.00"}},"no W-Extension","C","B",3926909790,"DE",9,"0.2",null,"-",null,4060039033000]
[null,"6649 981 51297","FAA-500","4.998.151.297","FAA500, base LSN","5A",{"v":52.5,"d":"52.50"},{"$f":"ROUND(ROUND(G130*4.8,2),0)","v":{"v":252,"d":"252.00"}},"no W-Extension","C","A",8536909599,"CN",174,"0.25",null,"SBN",null,8717332097494]
[null,"6649 981 51302","FAA-500-BB","4.998.151.302","FAA-500-BB, mount back box","5A",14.91,{"v":72,"d":"72.00"},"no W-Extension","C","A",3926909790,"CN",192,"0.166",null,"SBN",null,8717332097487]
[null,"6649 981 51296","FAA-500-TR-P","4.998.151.296","FAA-500-TR-P, transperant iris with color insert","5A",23.55,{"v":113,"d":"113.00"},"no W-Extension","C","A",3926909790,"CN",20,"0.049",null,"SBN",null,8717332097562]
[null,"6649 981 51295","FAA-500-TR-W","4.998.151.295","Trim ring for 500 Series, iris white","5A",5.92,{"v":28,"d":"28.00"},"no W-Extension","C","A",3926909790,"CN",151,"0.03",null,"SBN",null,8717332097555]
[null,"6650 005 10166","FAA-500-SB-H","F.01U.510.166","FAA-500-SB-H Surface mount back box with damp room seal ","5A",13.02,{"v":63,"d":"63.00"},"no W-Extension","C","A",3926909790,"CN",38,"0.266",null,"SBN",null,"8717332204748"]
[null,"6650 005 10028","FAA-500-SPRING","F.01U.510.028","FAA-500-SPRING for concrete / wooden ceilings","5A",9.07,{"v":44,"d":"44.00"},"no W-Extension","C","A",7320208990,"CN",10,"0.116","Price per piece. Order only 10 pcs or multiple of 10. E.g. needed 30 pcs, order 30 pcs","-",null,"8717332204793"]
[null,"6649 981 51299","FAA-500-R","4.998.151.299","FAA-500-R base LSN with relay","5A",52.48,{"v":252,"d":"252.00"},"no W-Extension","C","A",8536909599,"CN",2,"0.24",null,"SBN",null,"8717332283224"]
[null,"Accessories for 300 and 400 series",null,"",{"$nulls":4},"",{"$nulls":4},"",""]
[null,"6650 005 08658","FAA-MSR420","F.01U.508.658","FAA-420-R Base with Relay for 420 Series","5A",41.69,{"$f":"ROUND(ROUND(G138*4.8,2),0)","v":{"v":200,"d":"200.00"}},"no W-Extension","C","A",8536909599,"CN",28,"0.09",null,"SBN",null,"8717332206896"]
[null,"6649 980 21535","MS 400","4.998.021.535","MS 400, socket, surface/ flush mounted cable supply","5A",5.34,{"$f":"ROUND(ROUND(G139*4.8*1.28,2),0)","v":{"v":33,"d":"33.00"}},"no W-Extension","C",1,8536909599,"CN",3162,"0.009",null,"SBN",null,8717332019878]
[null,"7050 002 15139","MS 400 B","F.01U.215.139","MS 400 Detector Base with Bosch Logo","5A",5.01,{"$f":"ROUND(ROUND(G140*4.8*1.37,2),0)","v":{"v":33,"d":"33.00"}},"no W-Extension","C","A",8536909599,"CN",11606,"0.09",null,"SBN",null,8717332019878]
[null,"7050 002 15142","FAA-420-SEAL","F.01U.215.142","FAA-420-SEAL Damp Room Seal MS400 (10ps)","5A",120.08,{"$f":"ROUND(ROUND(G141*4.8,2),0)","v":{"v":576,"d":"576.00"}},"no W-Extension","C","A",8536909599,"CN",38,"0.23","One package unit contains 10 pcs. E.g. 50 pcs needed --> order 5","SBN",null,8717332808830]
[null,"6649 981 13025","MSC 420","4.998.113.025","MSC 420 Add base surface-mount","5A",6.78,{"$f":"ROUND(ROUND(G142*4.8,2),0)","v":{"v":33,"d":"33.00"}},"no W-Extension","C","A",3926909790,"CN",944,"0.1",null,"-",null,8717332020461]
[null,"6649 981 14565","MSR 320","4.998.114.565","MSR 320 GLT, Base with Relay","5A",29.65,{"v":142,"d":"142.00"},"no W-Extension","C",1,8536909599,"CN",254,"0.04",null,"SBN",null,8717332022519]
[null,"6649 980 25369","SK 400","4.998.025.369","SK 400, Metal cage for protection MagicSens detectors","5A",47.42,{"v":228,"d":"228.00"},"no W-Extension","C","A",7326909890,"DE",39,"0.3",null,"SBN",null,8717332003266]
[null,"6649 980 35312","SSK400","4.998.035.312","SSK 400, dust cover (10ps)","5A",25.54,{"v":123,"d":"123.00"},"no W-Extension","C","A",3926909790,"DE",123,"0.21","One package unit contains 10 pcs. E.g. 50 pcs needed --> order 5","SBN",null,8717332003310]
[null,"6649 980 84709","TP4 400","4.998.084.709","TP4 400, lettering strip till 4 m hight, (Attention!!! Order multiple, read comment)","5A",0.52,{"v":3,"d":"3.00"},"no W-Extension","C","A",3926909790,"DE",4597,"0.006","Order only 50 pcs or multiple of 50. E.g. needed 150 pcs, order 150 pcs","-",null,8717332003396]
[null,"6649 980 84710","TP8 400","4.998.084.710","TP8 400, lettering strip till 8 m hight, (Attention!!! Order multiple, read comment)","5A",0.55,{"v":3,"d":"3.00"},"no W-Extension","C","A",3926909790,"DE",879,"0.009","Order only 50 pcs or multiple of 50. E.g. needed 150 pcs, order 150 pcs","-",null,8717332003402]
[null,"6649 980 25373","MH 400",4998025373,"MH 400, detector heating","5A",47.68,{"v":229,"d":"229.00"},"no W-Extension","C","A",8531900000,"DE",15,"0.017",null,"-",null,8717332003280]
[null,"6649 980 97924","WA400","4.998.097.924","MK 400, detector console including socket","5A",42.35,{"v":203,"d":"203.00"},"no W-Extension","C","A",3926909790,"DE",33,"0.199",null,"-",null,8717332003426]
[null,"7050 002 89620","FAA-420-RI-DIN","F.01U.289.620","Remote Indicator","5A",46.01,{"v":221,"d":"221.00"},"no W-Extension","C",1,8531900000,"PT",175,"0.061",null,"SBN",null,8717332927982]
[null,"7050 002 89120","FAA-420-RI-ROW","F.01U.289.120","Remote Indicator","5A",15.32,{"v":74,"d":"74.00"},"no W-Extension","C","A",8531900000,"PT",1155,"0.058",null,"SBN",null,8717332926756]
[null,"6627 992 71257","FMX-DET-MB","2.799.271.257","MOUNT BRACKfalse floor mounting bracket","5A",24.31,{"v":117,"d":"117.00"},"no W-Extension","C","A",3926909790,"DE",84,"0.09",null,"-",null,8717332018994]
[null,"7050 002 39554","FAA-420-CAP-V0","F.01U.239.554","Detector cap, V0 rating (200 pcs)","5A",417.33,{"v":2003,"d":"2,003.00"},"no W-Extension","C","C","85369095","CN",0,"0.023","One unit contains 200 pcs. Minimum order quantity is 5 units (= 1.000 caps). Delivery time 3-4 months.","-","Mainly used for Israel",8717332822423]
[null,"7050 002 14891","MS 400 V0","F.01U.214.891","Detector base, V0 rating","5A",9.96,{"v":48,"d":"48.00"},"no W-Extension","C","C","85369095","CN",0,"0.081",null,"-","Mainly used for Israel",8717332808199]
[null,"Conventional detectors",null,"",{"$nulls":4},"",{"$nulls":4},"",""]
[null,"320 Series",null,"",{"$nulls":4},"",{"$nulls":4},"",""]
[null,"7050 000 26293","FCP-O320","F.01U.026.293","FCP-O320 optical conventional (820Ω)","5A",39.33,{"$f":"ROUND(ROUND(G157*4.8,2),0)","v":{"v":189,"d":"189.00"}},"on demand","C","A",8531103000,"CN",690,"0.072",null,"SBN",null,8717332253180]
[null,"7050 000 26292","FCP-OC320","F.01U.026.292","FCP-OC 320 optical/ chemical conv. det. (820Ω)","5A",173.17,{"$f":"ROUND(ROUND(G158*4.8,2),0)","v":{"v":831,"d":"831.00"}},"on demand","C","A",8531103000,"CN",23,"0.1",null,"SBN",null,8717332253173]
[null,"7050 000 26295","FCP-OT320","F.01U.026.295","FCP-OT 320 optical/ heat conv. Detector (820Ω)","5A",67.75,{"v":325,"d":"325.00"},"on demand","C","A",8531103000,"CN",113,"0.09",null,"SBN",null,8717332253210]
[null,"7050 000 26291","FCH-T320","F.01U.026.291","FCH-T 320 conv. RoR heat detector (820Ω)","5A",30.07,{"v":144,"d":"144.00"},"on demand","C","A",8531103000,"CN",134,"0.069",null,"SBN",null,8717332253166]
[null,"7050 000 26294","FCH-T320-FSA","F.01U.026.294","FCH-T 320-FSA Heat, RoR conv. Detector (820Ω)","5A",58.86,{"v":283,"d":"283.00"},"on demand","C","A",8531103000,"CN",2,"0.09",null,"SBN",null,8717332253203]
[null,"7850 000 29857","FCP-O320-R470","F.01U.029.857","FCP-O 320-R470 optical smoke detector (470Ω)","5A",39.33,{"v":189,"d":"189.00"},"on demand","C","A",8531900000,"CN",31,"0.09",null,"SBN",null,800549091664]
[null,"7850 000 29867","FCP-OC320-R470","F.01U.029.867","FCP-OC 320-R470 Combined opt/gas det. (470Ω)","5A",173.17,{"v":831,"d":"831.00"},"on demand","C","A",8531103000,"CN",2,"0.09",null,"SBN",null,800549091718]
[null,"7850 000 29862","FCP-OT320-R470","F.01U.029.862","FCP-OT 320-R470 optical/heat detector (470Ω)","5A",67.75,{"v":325,"d":"325.00"},"on demand","C","A",8531103000,"CN",4,"0.091",null,"SBN",null,800549091701]
[null,"7850 000 29861","FCH-T320-R470","F.01U.029.861","FCH-T 320-R470 heat detector (470Ω)","5A",30.07,{"v":144,"d":"144.00"},"on demand","C","A",8531103000,"CN",4,"0.099",null,"SBN",null,800549091695]
[null,"7050 000 83619","FLM-320-EOL2W","F.01U.083.619","FLM-320-EOL2W Conv EOL Module 2-Wire","5A",32.89,{"v":158,"d":"158.00"},"no W-Extension","C","A",8537109199,"CN",24,"0.03",null,"SBN",null,800549189309]
[null,705000083620,"FLM-320-EOL4W-S","F.01U.083.620","FLM-320-EOL4W-S Conv EOL Module 4-Wire","5A",144.68,{"v":694,"d":"694.00"},"on demand","C","A",8536501999,"CN",3,"0.48",null,"SBN",null,8717332361120]
[null,"500 Series",null,"",{"$nulls":4},"",{"$nulls":4},"",""]
[null,"7850 005 10647","FCA-500-EU","F.01U.510.647","FCA-500-EU base conventional for EU","5A",60.96,{"$f":"ROUND(ROUND(G169*4.8,2),0)","v":{"v":293,"d":"293.00"}},"no W-Extension","C","A",8536909599,"CN",40,"0.218",null,"SBN",null,8717332251490]
[null,"7850 005 10648","FCA-500-E-EU","F.01U.510.648","FCA-500-E-EU base conv-EOL for EU","5A",74.51,{"$f":"ROUND(ROUND(G170*4.8,2),0)","v":{"v":358,"d":"358.00"}},"no W-Extension","C","A",8536909599,"CN",7,"0.25",null,"SBN",null,8717332256228]
[null,"7850 005 12649","FCP-O 500","F.01U.510.649","FCP-O 500 conv opt smoke detector EU wh","5A",304.83,{"v":1463,"d":"1,463.00"},"on demand","C",1,8531103000,"CN",75,"0.308",null,"SBN",null,8717332251445]
[null,"7850 005 10653","FCP-OC 500","F.01U.510.653","FCP-OC 500 Multisens detect conv EU wh","5A",440.31,{"v":2113,"d":"2,113.00"},"on demand","C","A",8531103000,"CN",10,"0.217",null,"SBN",null,8717332251469]
[null,"7850 005 10654","FCP-O 500-P","F.01U.510.654","FCP-O 500-P conv opt smoke det EU tr","5A",318.38,{"v":1528,"d":"1,528.00"},"on demand","C","A",8531103000,"CN",10,"0.36",null,"SBN",null,8717332251476]
[null,"7850 005 10656","FCP-OC 500-P","F.01U.510.656","FCP-OC 500-P conv multisen detect EU tr","5A",453.86,{"v":2179,"d":"2,179.00"},"on demand","C","A",8531103000,"CN",1,"0.35",null,"SBN",null,8717332251483]
[null,"Detectors for explosive areas",null,"",{"$nulls":4},"",{"$nulls":4},"",""]
[null,"7050 002 79764","016519","F.01U.279.764","Flameproof (Exd) IR3 Flame Detector","5A",{"v":8447.08,"d":"8,447.08"},{"$f":"ROUND(ROUND(G176*4.8,2),0)","v":{"v":40546,"d":"40,546.00"}},"no W-Extension","C","A",8531103000,"GB",3,"2.5",null,"SBN",null,8717332906369]
[null,705000332582,"OOH740-A9-EX","F.01U.332.582","Dual-optical detector, explosive area","5A",547.29,{"$f":"ROUND(ROUND(G177*4.8,2),0)","v":{"v":2627,"d":"2,627.00"}},"no W-Extension","C","A",85311030000,"CH",23,"0.124",null,"SBN",null,4260451081447]
[null,705000332583,"FDB201","F.01U.332.583","Base for Dual-Optical Detector for Ex Area","5A",32.83,{"v":158,"d":"158.00"},"no W-Extension","C","A",85319085900,"CH",24,"0.025",null,"SBN",null,4260451081454]
[null,705000335165,"FDB291","F.01U.335.165","Base attachment","5A",24.32,{"v":117,"d":"117.00"},"no W-Extension","C","A",85319000000,"CH",11,"0.036",null,"SBN",null,4260451089573]
[null,705000335589,"FDB295","F.01U.335.589","Base attachment wet","5A",93.65,{"v":450,"d":"450.00"},"no W-Extension","C","A",85319000000,"CN",10,"0.286",null,"SBN",null,4060039000002]
[null,705000335595,"FDB295M","F.01U.335.595","Metal cable gland","5A",53.52,{"v":257,"d":"257.00"},"no W-Extension","C","A",90269000900,"CH",27,"0.354","1 bag contains 10 pcs.20 pcs needed, order 2 pcs. (bags) REUP per unit (= 10 pcs)","SBN",null,4060039000064]
[null,705000335593,"FDUD291","F.01U.335.593","Detector exchanger","5A",{"v":2091.86,"d":"2,091.86"},{"v":10041,"d":"10,041.00"},"no W-Extension","C","A",90318080000,"CH",0,"0.480",null,"SBN",null,4060039000040]
[null,705000335590,"FDBZ291","F.01U.335.590","Designation plate","5A",2.44,{"v":12,"d":"12.00"},"no W-Extension","C","A",85319000000,"CH",13,"0.024","Order only 10 pcs or multiple of 10. E.g. needed 30 pcs, order 30 pcs","SBN",null,4060039000019]
[null,705000335591,"FDBZ293","F.01U.335.591","Detector locking device","5A",0.96,{"v":5,"d":"5.00"},"no W-Extension","C","A",85319000000,"CH",0,"0.026","Order only 100 pcs or multiple of 100. E.g. needed 60 pcs, order 100 pcs","SBN",null,4060039000026]
[null,705000335592,"FDBZ295","F.01U.335.592","Sealing element","5A",19.46,{"v":93,"d":"93.00"},"no W-Extension","C","A",40169300900,"CH",3,"0.037",null,"SBN",null,4060039000033]
[null,705000335594,"FDZ291","F.01U.335.594","Detector dust cap","5A",3.65,{"v":18,"d":"18.00"},"no W-Extension","C","A",85319000000,"CH",4,"0.045","Order only 10 pcs or multiple of 10. E.g. needed 30 pcs, order 30 pcs","SBN",null,4060039000057]
[null,"6649 981 12085","SB3","4.998.112.085","SB3, Safety barrier (including input/output module DCA1192)","5A",899.99,{"v":4320,"d":"4,320.00"},"no W-Extension","C","A",8536909599,"DE",15,"1.19",null,"SBN",null,8717332003655]
[null,"6649 981 15785","DOW1171-ident","4.998.115.785","DBZ1193A,  DOW1171 Det identifier","5A",1.85,{"v":9,"d":"9.00"},"no W-Extension","C","A",{"v":8310000000,"d":"8310000000.00"},"CH",3,0,"Price per piece. Order only 10 pcs or multiple of 10. E.g. needed 30 pcs, order 30 pcs.","SBN",null,8717332020478]
[null,"Video-based Fire Detection",null,"",{"$nulls":4},"",{"$nulls":4},"",""]
[null,"7050 004 06348","FCS-8000-VFD-I","F.01U.406.348","AI-VFD Bullet 4MP 4.4-10mm IP67","5A",{"v":7089.08,"d":"7,089.08"},{"$f":"ROUND(ROUND(G190*4.8,2),0)","v":{"v":34028,"d":"34,028.00"}},"on demand","C","A",85258900,"PT",null,"3.285",null,"SBN",null,4060039159519]
[null,"7050  003 17536","FCS-8000-VFD-B","F.01U.317.536","AVIOTEC IP starlight 8000","5A",{"v":7089.08,"d":"7,089.08"},{"$f":"ROUND(ROUND(G191*4.8,2),0)","v":{"v":34028,"d":"34,028.00"}},"on demand","C","A",8525801931,"PT",44,"1.196",null,"SBN",null,8717332541010]
[null,"Wireless Devices",null,"",{"$nulls":4},"",{"$nulls":4},"",""]
[null,"66F01U349134","FWI-270","F.01U.349.134","Radio gateway","5A",{"v":1067.22,"d":"1,067.22"},{"$f":"ROUND(ROUND(G193*4.8,2),0)","v":{"v":5123,"d":"5,123.00"}},"no W-Extension","C","B",8517620000,"PT",11,"0.260",{"$nulls":3},4060039021670]
[null,"66F01U349135","FDOOT271-O","F.01U.349.135","Radio fire detector","5A",613.54,{"$f":"ROUND(ROUND(G194*4.8,2),0)","v":{"v":2945,"d":"2,945.00"}},"no W-Extension","C","B",8531900000,"CH",93,"0.134",{"$nulls":3},4060039021687]
[null,"66F01U349136","FDB271","F.01U.349.136","Base radio fire detector","5A",11.58,{"v":56,"d":"56.00"},"no W-Extension","C","B",8536909599,"CH",92,"0.039",{"$nulls":3},4060039021694]
[null,"66F01U349137","FDMH273-R","F.01U.349.137","Radio manual call point housing","5A",133.13,{"v":639,"d":"639.00"},"no W-Extension","C","B",8536501999,"CH",5,"0.285",{"$nulls":3},4060039021700]
[null,"66F01U349249","FDME273-O","F.01U.349.249","Radio manual call point switching unit","5A",769.82,{"v":3695,"d":"3,695.00"},"no W-Extension","C","B",8536501999,"CH",6,"0.108",{"$nulls":3},4060039022233]
[null,"66F01U349248","BAT3.6-10","F.01U.349.248","Li-SOCl2 battery pack 3.6V, 10 Ah","5A",78.72,{"v":378,"d":"378.00"},"no W-Extension","C","B",8506501000,"CH",120,"0.09",{"$nulls":3},4060039022226]
[null,"66F01U349251","FDM275-O","F.01U.349.251","Radio manual call point","5A",795.29,{"v":3817,"d":"3,817.00"},"no W-Extension","C","B",8536501999,"CH",1,"0.224",{"$nulls":3},4060039022257]
[null,"66F01U349250","DMZ1196-AC","F.01U.349.250","Spare glass FDM273-O","5A",10.77,{"v":52,"d":"52.00"},"no W-Extension","C","B",3926909790,"CH",4,"0.117","Price of 1 Pc.\nBut can be only ordered in set of 10 Pieces ",null,null,4060039022240]
[null,"66F01U349252","FDMG295","F.01U.349.252","Spare glass FDM275-O","5A",12.97,{"v":62,"d":"62.00"},"no W-Extension","C","B",926909790,"CH",1,"0.066","Price of 1 Pc.\nBut can be only ordered in set of 5 Pieces ",null,null,4060039022264]
[null,"66F01U349253","FDMP295","F.01U.349.253","Spare plastic FDM275-O","5A",19.45,{"v":93,"d":"93.00"},"no W-Extension","C","B",3926909790,"CH",0,"0.04","Price of 1 Pc.\nBut can be only ordered in set of 5 Pieces ",null,null,4060039022271]
[null,"66F01U349254","FDUZ227","F.01U.349.254","MCL USB ADAPTER","5A",{"v":1273.39,"d":"1,273.39"},{"v":6112,"d":"6,112.00"},"no W-Extension","C","B",8536909599,"CH",1,"0.197",{"$nulls":3},4060039022288]
[null,"Special detectors",null,"",{"$nulls":4},"",{"$nulls":4},"",""]
[null,"Titanus Smoke extraction systems Systems",{"$nulls":6},"",{"$nulls":4},"",""]
[null,"7050 000 78495","FAS-420-TM","F.01U.078.495","Smoke System","5A",{"v":1702.25,"d":"1,702.25"},{"$f":"ROUND(ROUND(G206*4.8,2),0)","v":{"v":8171,"d":"8,171.00"}},"no W-Extension","C","A",8536501999,"DE",11,"0.576",{"$nulls":3},8717332341863]
[null,"7050 000 78496","FAS-420-TM-R","F.01U.078.496","FAS-420-TM-R aspirating smoke detector","5A",{"v":2188.79,"d":"2,188.79"},{"$f":"ROUND(ROUND(G207*4.8,2),0)","v":{"v":10506,"d":"10,506.00"}},"no W-Extension","C","A",8536501999,"DE",1,"0.47",{"$nulls":3},8717332341870]
[null,"7050 000 78497","FAS-420-TM-RVB","F.01U.078.497","FAS-420-TM-RVB aspirating smoke detector","5A",{"v":2675.35,"d":"2,675.35"},{"v":12842,"d":"12,842.00"},"no W-Extension","C","A",8536501999,"DE",1,"0.47",{"$nulls":3},8717332341887]
[null,"7050 000 78494 ","FAS-420-TM-HB","F.01U.078.494","FAS-420-TM series housing base","5A",194.11,{"v":932,"d":"932.00"},"no W-Extension","C","A",8536909599,"DE",14,"0.468",{"$nulls":3},8717332341856]
[null,"6650 000 29252","FAS-420-TT1","F.01U.029.252","Titanus Top Sens TT1, LSNi","5A",{"v":4833.8,"d":"4,833.80"},{"v":23202,"d":"23,202.00"},"no W-Extension","C","A",8536501999,"DE",4,"1.341",{"$nulls":3},8717332263530]
[null,"6650 000 29253","FAS-420-TT2","F.01U.029.253","Titanus Top Sens TT2, LSNi","5A",{"v":4833.8,"d":"4,833.80"},{"v":23202,"d":"23,202.00"},"no W-Extension","C","A",8536501999,"DE",6,"1.45",{"$nulls":3},8717332263547]
[null,"6650 000 29255","FAS-420-TP1","F.01U.029.255","Titanus PRO SENS TP-1, LSNi","5A",{"v":2178.51,"d":"2,178.51"},{"v":10457,"d":"10,457.00"},"no W-Extension","C",1,8536501999,"DE",32,"1.53",{"$nulls":3},8717332263554]
[null,"6650 000 29256","FAS-420-TP2","F.01U.029.256","Titanus PRO SENS TP-2, LSNi","5A",{"v":2178.51,"d":"2,178.51"},{"v":10457,"d":"10,457.00"},"no W-Extension","C","A",8536501999,"DE",23,"1.45",{"$nulls":3},8717332263561]
[null,"7050 000 83877","FAS-420-TP1-SL","F.01U.083.877","Titanus Pro Sens Basic TP1 Silent","5A",{"v":2317.79,"d":"2,317.79"},{"v":11125,"d":"11,125.00"},"no W-Extension","C","A",8536501999,"DE",5,"1.45",{"$nulls":3},8717332382514]
[null,"7050 000 83876","FAS-420-TP2-SL","F.01U.083.876","Titanus Pro Sens Basic TP2 Silent","5A",{"v":2317.79,"d":"2,317.79"},{"v":11125,"d":"11,125.00"},"no W-Extension","C","A",8536501999,"DE",7,"1.55",{"$nulls":3},8717332382507]
[null,"7050 000 83875","FAS-420-TT1-SL","F.01U.083.875","Titanus Top Sens Basic TT1 Silent","5A",{"v":5312.36,"d":"5,312.36"},{"v":25499,"d":"25,499.00"},"no W-Extension","C","C",8531900000,"DE",0,"1.45",{"$nulls":3},8717332382491]
[null,"7050 000 83874","FAS-420-TT2-SL","F.01U.083.874","Titanus Top Sens Basic TT2 Silent","5A",{"v":5312.36,"d":"5,312.36"},{"v":25499,"d":"25,499.00"},"no W-Extension","C","A",8536501999,"DE",0,"1.57",{"$nulls":3},8717332382484]
[null,"7050 000 90252","FAS-ASD-SL","F.01U.090.252","Sound Suppressor for Aspirating","5A",242.85,{"v":1166,"d":"1,166.00"},"no W-Extension","C","A",3926909790,"DE",6,"0.43",{"$nulls":3},8717332815821]
[null,"6649 981 43394","DM-TP-50(80)","4.998.143.394","Detector module DM-TP-50(80)-LB/a INCOMPATIBLE WITH FAS-420 TP/TT","5A",604.23,{"v":2900,"d":"2,900.00"},"no W-Extension","C","A",8531900000,"DE",21,"0.11",null,null," INCOMPATIBLE WITH FAS-420 TP/TT",8717332036431]
[null,"6649 981 43395","DM-TP-10(25)","4.998.143.395","Detector module DM-TP-10(25)-LB/a INCOMPATIBLE WITH FAS-420 TP/TT","5A",986.49,{"v":4735,"d":"4,735.00"},"no W-Extension","C","A",8531900000,"DE",10,"0.116",null,null," INCOMPATIBLE WITH FAS-420 TP/TT",8717332036448]
[null,"6649 981 43396","DM-TP-01(05)","4.998.143.396","Detector module DM-TP-01(05)-LB/a INCOMPATIBLE WITH FAS-420 TP/TT","5A",{"v":2647.08,"d":"2,647.08"},{"v":12706,"d":"12,706.00"},"no W-Extension","C","A",8531900000,"DE",0,"0.1",null,null," INCOMPATIBLE WITH FAS-420 TP/TT",8717332036455]
[null,"6649 981 43400","DM-TT-50(80)","4.998.143.400","Detector module DM-TT-50(80)-LB/a","5A",608.34,{"v":2920,"d":"2,920.00"},"no W-Extension","C","A",8531900000,"DE",46,"0.1",{"$nulls":3},8717332036486]
[null,"6649 981 43401","DM-TT-10(25)",4998143401,"Detector module DM-TT-10(25)-LB/a","5A",986.49,{"v":4735,"d":"4,735.00"},"no W-Extension","C","A",8531900000,"DE",35,"0.14",{"$nulls":3},8717332036493]
[null,"6649 981 43402","DM-TT-01(05)","4.998.143.402","Detector module DM-TT-01(05)-LB/a","5A",{"v":2651.2,"d":"2,651.20"},{"v":12726,"d":"12,726.00"},"no W-Extension","C","A",8531900000,"DE",18,"0.125",{"$nulls":3},8717332036509]
[null,"Conventional smoke extraction systems ",null,"",{"$nulls":4},"",{"$nulls":4},"",""]
[null,"7050 001 41195","FCS-320-TM","F.01U.141.195","FCS-320-TM Conventional ASD","5A",{"v":1538.8,"d":"1,538.80"},{"$f":"ROUND(ROUND(G226*4.8,2),0)","v":{"v":7386,"d":"7,386.00"}},"on demand","C","A",8536501999,"DE",2,"0.53",{"$nulls":3},8717332485130]
[null,"7051 001 41196","FCS-320-TM-R","F.01U.141.196","FCS-320-TM-R Conventional ASD","5A",{"v":2025.35,"d":"2,025.35"},{"$f":"ROUND(ROUND(G227*4.8,2),0)","v":{"v":9722,"d":"9,722.00"}},"on demand","C","C",8536501999,"DE",0,"0.47",{"$nulls":3},8717332485147]
[null,"7052 001 41197","FCS-320-TP1","F.01U.141.197","FCS-320-TP1 Conventional ASD","5A",{"v":2013.85,"d":"2,013.85"},{"v":9666,"d":"9,666.00"},"on demand","C","A",8536501999,"DE",6,"1.282",{"$nulls":3},8717332485154]
[null,"7053 001 41198","FCS-320-TP2","F.01U.141.198","FCS-320-TP2 Conventional ASD","5A",{"v":2013.85,"d":"2,013.85"},{"v":9666,"d":"9,666.00"},"on demand","C","A",8536501999,"DE",8,"1.324",{"$nulls":3},8717332485161]
[null,"7050 001 41199","FCA-320-RESET","F.01U.141.199","Reset Board for FCS-320 series","5A",192.83,{"v":926,"d":"926.00"},"no W-Extension","C","A",8531900000,"DE",0,"0.02",{"$nulls":3},8717332485178]
[null,"7050 001 41200","FCA-320-RELAY","F.01U.141.200","Relay Module Type RU-1 for FCS-320-TM-R","5A",362.67,{"v":1741,"d":"1,741.00"},"no W-Extension","C","C",8536490099,"DE",0,"0.1",{"$nulls":3},8717332485185]
[null,"7054 001 41201","FCS-320-IK","F.01U.141.201","Installation Kid for add. modules","5A",44.71,{"v":215,"d":"215.00"},"no W-Extension","C","C",7326909890,"DE",0,"0.033",{"$nulls":3},8717332485192]
[null,"Titanus Accessories and reduction foils ",null,"",{"$nulls":4},"",{"$nulls":4},"",""]
[null,"6649 981 43410","TITANUS MT-1 mount","4.998.143.410","Fixing unit MT-1","5A",116.27,{"$f":"ROUND(ROUND(G234*4.8,2),0)","v":{"v":558,"d":"558.00"}},"no W-Extension","C","A",7326909890,"DE",2,"0.971",null,"-",null,8717332036516]
[null,"6649 981 43413","TITANUS AF-BR","4.998.143.413","fixing foil","5A",2.08,{"$f":"ROUND(ROUND(G235*4.8,2),0)","v":{"v":10,"d":"10.00"}},"no W-Extension","C","A",3926909790,"DE",750,"0.001","Order only 10 pcs or multiple of 10. E.g. needed 30 pcs, order 30 pcs. Price per piece","-",null,8717332036530]
[null,"6649 981 43416","TITANUS AF-2.0","4.998.143.416","reduction foil 2,0mm","5A",2.08,{"v":10,"d":"10.00"},"no W-Extension","C","A",3926909790,"DE",154,"0.017","Order only 10 pcs or multiple of 10. E.g. needed 30 pcs, order 30 pcs. Price per piece","-",null,8717332036547]
[null,"6649 981 43417","TITANUS AF-2.5","4.998.143.417","reduction foil 2,5mm","5A",2.08,{"v":10,"d":"10.00"},"no W-Extension","C","A",3926909790,"DE",150,"0.009","Order only 10 pcs or multiple of 10. E.g. needed 30 pcs, order 30 pcs. Price per piece","-",null,8717332036554]
[null,"6649 981 43418","TITANUS AF-3.0","4.998.143.418","reduction foil 3,0mm","5A",2.08,{"v":10,"d":"10.00"},"no W-Extension","C","A",3926909790,"DE",136,"0.001","Order only 10 pcs or multiple of 10. E.g. needed 30 pcs, order 30 pcs. Price per piece","-",null,8717332036561]
[null,"6649 981 43419","TITANUS AF-3.2","4.998.143.419","reduction foil 3,2mm","5A",2.08,{"v":10,"d":"10.00"},"no W-Extension","C","A",3926909790,"DE",125,"0.012","Order only 10 pcs or multiple of 10. E.g. needed 30 pcs, order 30 pcs. Price per piece","-",null,8717332036578]
[null,"6649 981 43420","TITANUS AF-3.4","4.998.143.420","reduction foil 3,4mm","5A",2.08,{"v":10,"d":"10.00"},"no W-Extension","C","A",3926909790,"DE",122,"0.116","Order only 10 pcs or multiple of 10. E.g. needed 30 pcs, order 30 pcs. Price per piece","-",null,8717332036585]
[null,"6649 981 43422","TITANUS AF-3.6","4.998.143.422","reduction foil 3,6mm","5A",2.08,{"v":10,"d":"10.00"},"no W-Extension","C","A",3926909790,"DE",132,"0.001","Order only 10 pcs or multiple of 10. E.g. needed 30 pcs, order 30 pcs. Price per piece","-",null,8717332036592]
[null,"6649 981 43423","TITANUS AF-3.8","4.998.143.423","reduction foil 3,8mm","5A",2.08,{"v":10,"d":"10.00"},"no W-Extension","C","A",3926909790,"DE",95,"0.366","Order only 10 pcs or multiple of 10. E.g. needed 30 pcs, order 30 pcs. Price per piece","-",null,8717332036608]
[null,"6649 981 43424","TITANUS AF-4.0","4.998.143.424","reduction foil 4,0mm","5A",2.08,{"v":10,"d":"10.00"},"no W-Extension","C","A",3926909790,"DE",126,"0.017","Order only 10 pcs or multiple of 10. E.g. needed 30 pcs, order 30 pcs. Price per piece","-",null,8717332036615]
[null,"6649 981 43425","TITANUS AF-4.2","4.998.143.425","reduction foil 4,2mm","5A",2.08,{"v":10,"d":"10.00"},"no W-Extension","C","A",3926909790,"DE",50,"0.017","Order only 10 pcs or multiple of 10. E.g. needed 30 pcs, order 30 pcs. Price per piece","-",null,8717332036622]
[null,"6649 981 43426","TITANUS AF-4.4","4.998.143.426","reduction foil 4,4mm","5A",2.08,{"v":10,"d":"10.00"},"no W-Extension","C","A",3926909790,"DE",52,"0.017","Order only 10 pcs or multiple of 10. E.g. needed 30 pcs, order 30 pcs. Price per piece","-",null,8717332036639]
[null,"6649 981 43427","TITANUS AF-4.6","4.998.143.427","reduction foil 4,6mm","5A",2.08,{"v":10,"d":"10.00"},"no W-Extension","C","A",3926909790,"DE",37,"0.017","Order only 10 pcs or multiple of 10. E.g. needed 30 pcs, order 30 pcs. Price per piece","-",null,8717332036646]
[null,"6649 981 43428","TITANUS AF-5.0","4.998.143.428","reduction foil 5,0mm","5A",2.08,{"v":10,"d":"10.00"},"no W-Extension","C","A",3926909790,"DE",53,"0.042","Order only 10 pcs or multiple of 10. E.g. needed 30 pcs, order 30 pcs. Price per piece","-",null,8717332036653]
[null,"6649 981 43429","TITANUS AF-5.2","4.998.143.429","reduction foil 5,2mm","5A",2.08,{"v":10,"d":"10.00"},"no W-Extension","C","A",3926909790,"DE",30,"0.008","Order only 10 pcs or multiple of 10. E.g. needed 30 pcs, order 30 pcs. Price per piece","-",null,8717332036660]
[null,"6649 981 43430","TITANUS AF-5.6","4.998.143.430","reduction foil 5,6mm","5A",2.08,{"v":10,"d":"10.00"},"no W-Extension","C","A",3926909790,"DE",45,"0.003","Order only 10 pcs or multiple of 10. E.g. needed 30 pcs, order 30 pcs. Price per piece","-",null,8717332036677]
[null,"6649 981 43431","TITANUS AF-6.0","4.998.143.431","reduction foil 6,0mm","5A",2.08,{"v":10,"d":"10.00"},"no W-Extension","C","A",3926909790,"DE",53,"0.017","Order only 10 pcs or multiple of 10. E.g. needed 30 pcs, order 30 pcs. Price per piece","-",null,8717332036684]
[null,"6649 981 43432","TITANUS AF-6.8","4.998.143.432","reduction foil 6,8mm","5A",2.08,{"v":10,"d":"10.00"},"no W-Extension","C","A",3926909790,"DE",35,"0.017","Order only 10 pcs or multiple of 10. E.g. needed 30 pcs, order 30 pcs. Price per piece","-",null,8717332036691]
[null,"6649 981 43433","TITANUS AF-7.0","4.998.143.433","reduction foil 7,0mm","5A",2.08,{"v":10,"d":"10.00"},"no W-Extension","C","A",3926909790,"DE",51,"0.017","Order only 10 pcs or multiple of 10. E.g. needed 30 pcs, order 30 pcs. Price per piece","-",null,8717332036707]
[null,"6649 981 48848","RAS test-pipe","4.998.148.848","Test tube","5A",68.91,{"v":331,"d":"331.00"},"no W-Extension","C","A",8531900000,"DE",4,"0.12",null,"-",null,8717332036714]
[null,"6649 981 48849","RAS test adapter","4.998.148.849","Test adapter","5A",43.07,{"v":207,"d":"207.00"},"no W-Extension","C","A",3917400099,"DE",8,"0.116",null,"-",null,8717332036721]
[null,"6650 000 33505","FAS-ASD-DIAG","F.01U.033.505","Diagnostic cable incl. software DIAG 3","5A",925.77,{"v":4444,"d":"4,444.00"},"no W-Extension","C","A",8523491000,"DE",2,"0.6",{"$nulls":3},8717332289066]
[null,"Accessories for Titanus ",null,"",{"$nulls":4},"",{"$nulls":4},"",""]
[null,"6650 000 29727","FAS-ASD-AHC","F.01U.029.727","Aspiration hose for ceiling let through","5A",648.84,{"$f":"ROUND(ROUND(G257*4.8,2),0)","v":{"v":3114,"d":"3,114.00"}},"no W-Extension","C","A",3917320099,"DE",3,"1.98",{"$nulls":3},8717332264858]
[null,"6650 000 29725","FAS-ASD-CLT","F.01U.029.725","Ceiling let through","5A",22.07,{"$f":"ROUND(ROUND(G258*4.8,2),0)","v":{"v":106,"d":"106.00"}},"no W-Extension","C","A",3917400099,"DE",42,"0.009","Delivered in packages of 10 pcs. If 30 pcs needed, order 30 pcs. BLP is per piece.",null,null,8717332264834]
[null,"6650 000 29724","FAS-ASD-AR","F.01U.029.724","Aspiration Reduction","5A",8.03,{"v":39,"d":"39.00"},"no W-Extension","C","A",3926909790,"DE",0,"0.01",{"$nulls":3},8717332264827]
[null,"6650 000 29722","FAS-ASD-F","F.01U.029.722","Flange","5A",56.86,{"v":273,"d":"273.00"},"no W-Extension","C","A",3926909790,"DE",9,"0.333",{"$nulls":3},8717332264803]
[null,"6650 000 29721","FAS-ASD-TRPG16","F.01U.029.721","Threaded ring, PG 16","5A",9.37,{"v":45,"d":"45.00"},"no W-Extension","C","A",3917400099,"DE",60,"0.09",{"$nulls":3},8717332264797]
[null,"6650 000 29720","FAS-ASD-CSL","F.01U.029.720","Connection straight line","5A",8.03,{"v":39,"d":"39.00"},"no W-Extension","C","A",3917400099,"DE",157,"0.017",{"$nulls":3},8717332264780]
[null,"6650 000 29719","FAS-ASD-PHF16","F.01U.029.719","Polywell hose flexible, PG 16","5A",501.69,{"v":2408,"d":"2,408.00"},"no W-Extension","C","A",3917320099,"DE",1,"2.42",{"$nulls":3},8717332264773]
[null,"6650 000 29718","FAS-ASD-3WT","F.01U.029.718","Three way tap","5A",234.13,{"v":1124,"d":"1,124.00"},"no W-Extension","C","A",8481808190,"DE",29,"0.306",{"$nulls":3},8717332264766]
[null,"6650 000 29717","FAS-ASD-WS","F.01U.029.717","Water Separator","5A",602.02,{"v":2890,"d":"2,890.00"},"no W-Extension","C","A",8421210090,"DE",2,"1.324",{"$nulls":3},8717332264759]
[null,"6650 000 29716","FAS-ASD-DSB","F.01U.029.716","Detonation Safety barrier","5A",{"v":2408.08,"d":"2,408.08"},{"v":11559,"d":"11,559.00"},"no W-Extension","C","A",7326909890,"DE",0,"1.341",{"$nulls":3},8717332264742]
[null,"6650 000 29715","FAS-ASD-RFL","F.01U.029.715","Replacement Filter Large","5A",48.16,{"v":231,"d":"231.00"},"no W-Extension","C","A",84219900,"DE",97,"0.018",{"$nulls":3},8717332264735]
[null,"6650 000 29714","FAS-ASD-FL","F.01U.029.714","Filterbox Large","5A",240.81,{"v":1156,"d":"1,156.00"},"no W-Extension","C","A",8421999099,"DE",56,"0.43",{"$nulls":3},8717332264728]
[null,"Fireray Linear Smoke Detectors",null,"",{"$nulls":4},"",{"$nulls":4},"",""]
[null,"7050 002 90195","FIRERAY3000","F.01U.290.195","Fireray 3000 End-To-End Linear Beam","5A",{"v":2991.52,"d":"2,991.52"},{"$f":"ROUND(ROUND(G270*4.8,2),0)","v":{"v":14359,"d":"14,359.00"}},"no W-Extension","C","A",8536501999,"GB",7,"1.62",null,null,"Successor of Fireray 2000",8717332929009]
[null,"7050 004 00533","FRAY-ONE-EN","F.01U.400.533","Linear Beam, standalone reflective","5A",{"v":1446.22,"d":"1,446.22"},{"$f":"ROUND(ROUND(G271*4.8,2),0)","v":{"v":6942,"d":"6,942.00"}},"no W-Extension","C","A","85365019","GB",15,"0.800",null,null,"Successor of FR50/100",4060039150370]
[null,"7050 002 90196","FIRERAY3000-HD","F.01U.290.196","Fireray 3000 additional Head","5A",{"v":2584.57,"d":"2,584.57"},{"v":12406,"d":"12,406.00"},"no W-Extension","C","A",8536501999,"GB",2,"0.65",{"$nulls":3},8717332929016]
[null,"7050 002 90197","FIRERAY5000-EN","F.01U.290.197","Fireray 5000 Refl. linear beam detector","5A",{"v":2402.92,"d":"2,402.92"},{"v":11534,"d":"11,534.00"},"no W-Extension","C","A",8536501999,"GB",10,"2.106",null,null,"Successor of FRAY 5000 Types",8717332929023]
[null,"7050 001 43257","FRAY5000-HEAD-EN","F.01U.143.247","Additional head for FRAY5000-EN","5A",{"v":1392.16,"d":"1,392.16"},{"v":6682,"d":"6,682.00"},"no W-Extension","C","A",8531900000,"GB",7,"0.666",{"$nulls":3},8717332493821]
[null,705000083264,"FRAY5000-LR-KIT","F.01U.083.264","Fireray5000 long range kit 50m extension","5A",389.09,{"v":1868,"d":"1,868.00"},"no W-Extension","C","A",8536501999,"GB",18,"0.18",{"$nulls":3},8717332359769]
[null,"7050 000 98240","FRAY5000-BR","F.01U.098.240","Universal Bracket Accessory for Fray5000","5A",389.97,{"v":1872,"d":"1,872.00"},"no W-Extension","C","A",7326909890,"US",14,"0.199",{"$nulls":3},8717332390779]
[null,"7050 000 98241","FRAY5000-4PRISM","F.01U.098.241","Prism Plate for  4 prism","5A",246.84,{"v":1185,"d":"1,185.00"},"no W-Extension","C","A",7326909890,"US",7,"0.383",{"$nulls":3},8717332390786]
[null,"7050 000 98242","FRAY5000-1PRISM","F.01U.098.242","Prism Plate for 1 Prism","5A",215.99,{"v":1037,"d":"1,037.00"},"no W-Extension","C","A",7326909890,"US",6,"0.09",{"$nulls":3},8717332390793]
[null,"Heat detectors",null,"",{"$nulls":4},"",{"$nulls":4},"",""]
[null,"7050 003 32846","FCS-LHD-2EN ","F.01U.393.476","Linear heat detector, VdS","5A",{"v":3028.9,"d":"3,028.90"},{"$f":"ROUND(ROUND(G280*4.8,2),0)","v":{"v":14539,"d":"14,539.00"}},"no W-Extension","C","A",8536501990,"GB",null,"0.950",{"$nulls":3},4060039128997]
[null,"7050 003 95474","FCS-LHDSC-EN100","F.01U.395.474","Sensor cable PVC, VdS, 100m","5A",{"v":1435.88,"d":"1,435.88"},{"$f":"ROUND(ROUND(G281*4.8,2),0)","v":{"v":6892,"d":"6,892.00"}},"no W-Extension","C","A",85444993,"GB",1,"2.470","Sensor cable on reel 100m",null,null,4060039133205]
[null,"7051 003 95475","FCS-LHDSC-EN250","F.01U.395.475","Sensor cable PVC, VdS, 250m","5A",{"v":3592.18,"d":"3,592.18"},{"v":17242,"d":"17,242.00"},"no W-Extension","C","A",85444993,"GB",1,"6.180","Sensor cable on reel 250m",null,null,4060039133212]
[null,"7052 003 95476","FCS-LHDSC-EN500","F.01U.395.476","Sensor cable PVC, VdS, 500m","5A",{"v":7156.54,"d":"7,156.54"},{"v":34351,"d":"34,351.00"},"no W-Extension","C","A",85444993,"GB",2,"12.350","Sensor cable on reel 500m",null,null,4060039133229]
[null,"7050 004 03515","FCS-LHDSC-NYL100","F.01U.403.515","Sensor cable nylon, VdS, 100m","5A",{"v":1806.28,"d":"1,806.28"},{"v":8670,"d":"8,670.00"},"no W-Extension","C","A",85444993,"GB",0,"3.510","Sensor cable on reel 100m",null,null,4060039154903]
[null,"7051 004 03516","FCS-LHDSC-NYL250","F.01U.403.516","Sensor cable nylon, VdS, 250m","5A",{"v":4458.54,"d":"4,458.54"},{"v":21401,"d":"21,401.00"},"no W-Extension","C","A",85444993,"GB",0,"8.780","Sensor cable on reel 250m",null,null,4060039154910]
[null,"7052 004 03517","FCS-LHDSC-NYL500","F.01U.403.517","Sensor cable nylon, VdS, 500m","5A",{"v":8688.45,"d":"8,688.45"},{"v":41705,"d":"41,705.00"},"no W-Extension","C","A",85444993,"GB",0,"17.550","Sensor cable on reel 500m",null,null,4060039154927]
[null,"7053 004 03518","FCS-LHDSC-STL100","F.01U.403.518","Sensor cable steel, VdS, 100m","5A",{"v":2892.34,"d":"2,892.34"},{"v":13883,"d":"13,883.00"},"no W-Extension","C","A",85444993,"GB",0,"3.770","Sensor cable on reel 100m",null,null,4060039154934]
[null,"7054 004 03519","FCS-LHDSC-STL250","F.01U.403.519","Sensor cable steel, VdS, 250m","5A",{"v":7073.66,"d":"7,073.66"},{"v":33954,"d":"33,954.00"},"no W-Extension","C","A",85444993,"GB",0,"9.430","Sensor cable on reel 250m",null,null,4060039154941]
[null,"7055 004 03520","FCS-LHDSC-STL500","F.01U.403.520","Sensor cable steel, VdS, 500m","5A",{"v":13832.94,"d":"13,832.94"},{"v":66398,"d":"66,398.00"},"no W-Extension","C","A",85444993,"GB",0,"18.850","Sensor cable on reel 500m",null,null,4060039154958]
[null,"7050 003 95477","FCS-LHD2EN-EOL","F.01U.395.477","End-of-line module, VdS","5A",382.29,{"v":1835,"d":"1,835.00"},"no W-Extension","C","A",85319000,"GB",0,"0.112",{"$nulls":3},4060039133236]
[null,"7051 003 95478","FCS-LHD2EN-CONN","F.01U.395.478","Connection module, VdS","5A",294.07,{"v":1412,"d":"1,412.00"},"no W-Extension","C","A",85319000,"GB",1,"0.211",{"$nulls":3},4060039133243]
[null,"7050 003 98503","FCS-LHD2EN-FIX","F.01U.398.503","Fixing base, 20mm","5A",238.51,{"v":1145,"d":"1,145.00"},"no W-Extension","C","A",85319000,"GB",0,"0.240",{"$nulls":3},4060039147196]
[null,"7050 003 95480","FCS-LHD2EN-CLIP","F.01U.395.480","L-Clip, 50mm","5A",280.55,{"v":1347,"d":"1,347.00"},"no W-Extension","C","A",73261990,"GB",0,"0.040","One unit contains 100 pcs. When 200 clips needed, order 2 units",null,null,4060039133267]
[null,"7050 003 95479","FCS-LHD2EN-SLE","F.01U.395.479","Silicone sleeves","5A",73.51,{"v":353,"d":"353.00"},"no W-Extension","C","A",39259010,"GB",0,"1.590",{"$nulls":3},4060039133250]
[null,"Duct detector",null,"",{"$nulls":4},"",{"$nulls":4},"",""]
[null,"7850 000 29411","FAD-420-HS-EN","F.01U.029.411","Air sampling housing with MS400 base","5A",210.45,{"$f":"ROUND(ROUND(G296*4.8,2),0)","v":{"v":1010,"d":"1,010.00"}},"no W-Extension","C","A",8536909599,"CN",125,"1.944",{"$nulls":3},8717332264193]
[null,"7050 003 08231","FAD-425-O-R","F.01U.308.231","Detector for use in air sampling housing","5A",105.29,{"$f":"ROUND(ROUND(G297*4.8,2),0)","v":{"v":505,"d":"505.00"}},"on demand","C","A",8531103000,"PT",136,"0.077",null,"SBN",null,8717332974498]
[null,"6650 000 29219","D344-1.5","F.01U.029.219","DUCT SAMPLE TUBE 1.5 FEET","5A",21.71,{"v":104,"d":"104.00"},"no W-Extension","C","A",7608208990,"CN",11,"0.058",{"$nulls":3},8717332288274]
[null,"6650 000 29175","D344-3","F.01U.029.175","DUCT SAMPLE TUBE 3 FOOT","5A",42.14,{"v":202,"d":"202.00"},"no W-Extension","C","A",7608208990,"CN",31,"0.116",{"$nulls":3},8717332288458]
[null,"6650 000 29174","D344-5","F.01U.029.174","SAMPLE TUBE 5FT (DS290)","5A",70.24,{"v":337,"d":"337.00"},"no W-Extension","C","A",7608208990,"CN",31,"0.21",{"$nulls":3},8717332288465]
[null,"1826 950 89828","D344-TF","F.01U.425.789","DUCT TUBE FILTERS 20/PK","5A",{"v":130,"d":"130.00"},{"v":624,"d":"624.00"},"no W-Extension","C","A",8421999099,"CN",2,"0.14",{"$nulls":3},782695089828]
[null,"7850 000 29619","FAD-RB-DIBT","F.01U.029.619","Relay board for DIBT application","5A",46.04,{"v":221,"d":"221.00"},"no W-Extension","C","A",85371099,"CN",4,"0.018",{"$nulls":3},800549091183]
[null,"Infrared flame detector",null,"",{"$nulls":4},"",{"$nulls":4},"",""]
[null,null,"922819","F.01U.418.818","IR flame detector FMX5000 IR VK","5A",{"v":6093.75,"d":"6,093.75"},{"$f":"ROUND(ROUND(G304*4.8,2),0)","v":{"v":29250,"d":"29,250.00"}},"no W-Extension","C","C",85365019,"DE",null,"0.590","For operation of the detector order also:  929144, 924441, optional: 904757",null,null,4060039188960]
[null,null,924420,"F.01U.418.819","IR-flame detector FMX5000 IR 3GD","5A",{"v":7552.08,"d":"7,552.08"},{"$f":"ROUND(ROUND(G305*4.8,2),0)","v":{"v":36250,"d":"36,250.00"}},"no W-extension","C","C","90318080","DE",2,"0.590","For operation of the detector order also 926826, 924442, optional:  904757",null,null,4060039188977]
[null,null,926826,"F.01U.418.822","Relay module KMX5000 RK 3GD VK","5A",{"v":625,"d":"625.00"},{"v":3000,"d":"3,000.00"},"no W-extension","C","C","85319085","DE",2,"0.050",{"$nulls":3},4060039189004]
[null,null,929144,"F.01U.418.821","Relay module KMX5000 RK VK","5A",465.54,{"v":2235,"d":"2,235.00"},"no W-Extension","C","C",85319000,"DE",null,"0.050",{"$nulls":3},4060039188991]
[null,null,924441,"F.01U.418.824","Socket MX5000 VK","5A",{"v":315.1,"d":"315.10"},{"v":1512,"d":"1,512.00"},"no W-Extension","C","C",85389099,"DE",null,"0.380",{"$nulls":3},4060039189028]
[null,null,904757,"F.01U.418.826","Bracket MX5000","5A",49.36,{"v":237,"d":"237.00"},"no W-Extension","C","C",85389099,"DE",null,"0.095",{"$nulls":3},4060039189042]
[null,null,911674,"F.01U.418.820","IR-flame detector FMX5000 IR Ex","5A",{"v":8854.17,"d":"8,854.17"},{"v":42500,"d":"42,500.00"},"no W-Extension","C","C","90318080","DE",null,"0.590","Order together with: 922689 and 924442. Order optional 904757",null,null,4060039188984]
[null,null,922689,"F.01U.418.823","Safety barrier Ex isol. 24V 2 channel","5A",{"v":1953.13,"d":"1,953.13"},{"v":9375,"d":"9,375.00"},"no W-Extension","C","C","85363010","DE",null,"0.150",{"$nulls":3},4060039189011]
[null,null,924442,"F.01U.418.825","Socket MX5000 Ex VK","5A",572.92,{"v":2750,"d":"2,750.00"},"no W-Extension","C","C","85389099","DE",null,"0.530",{"$nulls":3},4060039189035]
[null,"7050 002 79762","016589","F.01U.279.762","IR3 Flame Detector","5A",{"v":6770.83,"d":"6,770.83"},{"v":32500,"d":"32,500.00"},"no W-Extension","C","A",8536501999,"GB",6,"2.0",null,"SBN",null,8717332906345]
[null,"7050 002 79880","007127","F.01U.279.880","Mounting Bracket Flame Detector","5A",{"v":401.1,"d":"401.10"},{"v":1925,"d":"1,925.00"},"no W-Extension","C","A",8536501999,"GB",9,"0.655",null,"SBN",null,8717332906376]
[null,"Addressable manual call points",null,"",{"$nulls":4},"",{"$nulls":4},"",""]
[null,"6650 000 11956","FMC-210-DM-G-R","F.01U.011.956","FMC-210-DM-G-R MCP LSN indoor red","5A",59.62,{"$f":"ROUND(ROUND(G316*4.8,2),0)","v":{"v":286,"d":"286.00"}},"no W-Extension","C",1,8536501999,"CN",992,"0.237",null,"SBN",null,8717332250127]
[null,"6650 000 11958","FMC-210-DM-H-R","F.01U.011.958","FMC-210-DM-H-R MCP LSN outdoor red","5A",149.02,{"$f":"ROUND(ROUND(G317*4.8,2),0)","v":{"v":715,"d":"715.00"}},"no W-Extension","C",1,8536501999,"CN",62,"0.244",null,"SBN",null,8717332250134]
[null,"6650 000 11959","FMC-210-DM-G-B","F.01U.011.959","FMC-210-DM-G-B MCP LSN Indoor blue","5A",59.62,{"v":286,"d":"286.00"},"no W-Extension","C",1,8536501999,"CN",222,"0.252",null,"SBN",null,8717332250141]
[null,"6650 000 11960","FMC-210-DM-H-B","F.01U.011.960","FMC-210-DM-H-B MCP LSN outdoor blue","5A",149.02,{"v":715,"d":"715.00"},"no W-Extension","C","A",8531900000,"CN",7,"0.249",null,"SBN",null,8717332250158]
[null,"6650 000 11961","FMC-210-DM-G-Y","F.01U.011.961","FMC-210-DM-G-Y MCP LSN indoor yellow","5A",59.62,{"v":286,"d":"286.00"},"no W-Extension","C","A",8531900000,"CN",28,"0.241",null,"SBN",null,8717332250165]
[null,"6650 000 11962","FMC-210-SM-G-R","F.01U.011.962","FMC-210-SM-G-R single action indoor red","5A",62.14,{"v":298,"d":"298.00"},"no W-Extension","C","A",8536501999,"CN",20,"0.236",{"$nulls":3},8717332250172]
[null,"7850 000 27317","FMC-210-SM-G-B","F.01U.027.317","FMC-210-SM-G-B single action indoor blue","5A",62.14,{"v":298,"d":"298.00"},"no W-Extension","C","A",8536501999,"CN",4,"0.249",{"$nulls":3},8717332256686]
[null,"7050 003 28502 ","FMC-210-DM-G-GR","F.01U.328.502","FMC-210-DM-G-GR MCP LSN Indoor green","5A",59.62,{"v":286,"d":"286.00"},"on demand","C",1,8536501999,"CN",15,"0.249",null,"SBN",null,8717332951499]
[null,"6650 000 12781","FMC-420RW-GSGRD","F.01U.012.781","MCP_LSNi_INDOOR_SURFACE_GLASS_RED","5A",69.91,{"v":336,"d":"336.00"},"on demand","C","A",8536501999,"CN",64,"0.835",{"$nulls":3},8717332259236]
[null,"6650 000 12782","FMC-420RW-GSRRD","F.01U.012.782","MCP_LSNi_INDOOR_SURFMT_RESET_RED","5A",69.91,{"v":336,"d":"336.00"},"on demand","C",1,8536501999,"CN",497,"0.183",{"$nulls":3},8717332259243]
[null,"6650 000 12783","FMC-420RW-GFGRD","F.01U.012.783","MCP_LSNi_INDOOR_FLUSHMOUNT_GLASS_RED","5A",69.91,{"v":336,"d":"336.00"},"on demand","C","A",8536501999,"CN",3,"0.183",{"$nulls":3},8717332259250]
[null,"6650 000 12784","FMC-420RW-GFRRD","F.01U.012.784","MCP_LSNi_INDOOR_FLUSHMOUNT_RESET_RED","5A",69.91,{"v":336,"d":"336.00"},"on demand","C","A",8536501999,"CN",28,"0.17",{"$nulls":3},8717332259267]
[null,"6650 000 12707","FMC-420RW-GSGBU","F.01U.012.707","MCP_LSNi_INDOOR_SURFMT_GLASS_BLUE","5A",69.91,{"v":336,"d":"336.00"},"on demand","C","C",8536501999,"CN",0,"0.241",{"$nulls":3},"8717332259199"]
[null,"6650 000 12708","FMC-420RW-GSRBU","F.01U.012.708","MCP_LSNi_INDOOR_SURFMT_RESET_BLUE","5A",69.91,{"v":336,"d":"336.00"},"on demand","C","A",8536501999,"CN",12,"0.835",{"$nulls":3},"8717332259205"]
[null,"6650 000 12787","FMC-420RW-GSGYE","F.01U.012.787","MCP_LSNi_INDOOR_SURFMT_GLASS_YEL","5A",69.91,{"v":336,"d":"336.00"},"on demand","C","C",8536501999,"CN",0,"0.249",{"$nulls":3},"8717332259274"]
[null,"6650 000 12788","FMC-420RW-GSRYE","F.01U.012.788","MCP_LSNi_INDOOR_SURFMT_RESET_YEL","5A",69.91,{"v":336,"d":"336.00"},"on demand","C","A",8536501999,"CN",27,"0.249",{"$nulls":3},"8717332259281"]
[null,665000012709,"FMC-420RW-HSGRD","F.01U.012.709","MCP LSNi, Outdoor (H), Surface mounted, Glass, Red","5A",230.18,{"v":1105,"d":"1,105.00"},"on demand","C","A",8536501999,"CN",9,"0.3",{"$nulls":3},8717332259212]
[null,665000012780,"FMC-420RW-HSRRD","F.01U.012.780","MCP LSNi, Outdoor (H), Surface mounted, Resettable, Red","5A",230.18,{"v":1105,"d":"1,105.00"},"on demand","C",1,8536501999,"CN",36,"0.468",{"$nulls":3},8717332259229]
[null,"7050 002 49820","FMC-420IS-GSRRD","F.01U.249.820","Manual call point resettable red, Israel","5A",69.16,{"v":332,"d":"332.00"},"on demand","C","C","85319000","CN",0,0.27,null,null,"Mainly used for Israel",8717332828876]
[null,"Conventional manual call points",null,"",{"$nulls":4},"",{"$nulls":4},"",""]
[null,"6650 000 11951","FMC-120-DKM-G-R","F.01U.011.951","FMC-120-DKM-G-R MCP conv indoor red","5A",39.29,{"$f":"ROUND(ROUND(G336*4.8,2),0)","v":{"v":189,"d":"189.00"}},"no W-Extension","C",1,8536501999,"CN",59,"0.243",null,"SBN",null,8717332250073]
[null,"6650 000 11952","FMC-120-DKM-H-R","F.01U.011.952","FMC-120-DKM-H-R MCP conv outdoor red","5A",98.89,{"$f":"ROUND(ROUND(G337*4.8,2),0)","v":{"v":475,"d":"475.00"}},"no W-Extension","C","A",8536501999,"CN",23,"0.233",null,"SBN",null,8717332250080]
[null,"6650 000 11953","FMC-120-DKM-G-B","F.01U.011.953","FMC-120-DKM-G-B MCP conv Indoor blue","5A",39.29,{"v":189,"d":"189.00"},"no W-Extension","C","A",8536501999,"CN",69,"0.224",null,"SBN",null,8717332250097]
[null,"6650 000 11954","FMC-120-DKM-H-B","F.01U.011.954","FMC-120-DKM-H-B MCP conv Outdoor blue","5A",98.89,{"v":475,"d":"475.00"},"no W-Extension","C","A",8536501999,"CN",4,"0.237",null,"SBN",null,8717332250103]
[null,"6650 000 12763","FMC-120-EST-G-B","F.01U.012.763","FMC-120-EST-G-B Stop dev. indoor, blue","5A",{"v":59.2,"d":"59.20"},{"v":284,"d":"284.00"},"no W-Extension","C","A",8536501999,"CN",17,"0.224",null,"SBN",null,8717332258024]
[null,"6650 000 11955","FMC-120-DKM-G-Y","F.01U.011.955","FMC-120-DKM-G-Y MCP conv Indoor yellow","5A",39.29,{"v":189,"d":"189.00"},"no W-Extension","C","A",8536501999,"CN",135,"0.222",null,"SBN",null,8717332250110]
[null,"6650 000 12771","FMC-300RW-GSGRD","F.01U.012.771","MCP_CONV_820_INDOOR_SURFMT_GLASS_RED","5A",36.16,{"v":174,"d":"174.00"},"on demand","C","A",8536501999,"CN",3,"0.249",{"$nulls":3},8717332259090]
[null,"6650 000 12777","FMC-300RW-GSRRD","F.01U.012.777","MCP_CONV_820_INDOOR_SURFMT_RESET_RED","5A",36.16,{"v":174,"d":"174.00"},"on demand","C","A",8536501999,"CN",146,"0.27",{"$nulls":3},8717332259168]
[null,"6650 000 12724","FMC-300RW-GSGBU","F.01U.012.724","MCP_CONV_820_INDOOR_SURFMT_GLASS_BLUE","5A",36.16,{"v":174,"d":"174.00"},"on demand","C","A",8536501999,"CN",2,"0.241",{"$nulls":3},"8717332259144"]
[null,"6650 000 12770","FMC-300RW-GSRBU","F.01U.012.770","MCP_CONV_820_INDOOR_SURFMT_RESET_BLUE","5A",36.16,{"v":174,"d":"174.00"},"on demand","C","A",8536501999,"CN",8,"0.249",{"$nulls":3},"8717332259083"]
[null,"6650 000 12778","FMC-300RW-GSGYE","F.01U.012.778","MCP_CONV_820_INDOOR_SURFMT_GLASS_YEL","5A",36.16,{"v":174,"d":"174.00"},"on demand","C","A",8536501999,"CN",2,"0.249",{"$nulls":3},"8717332259175"]
[null,"6650 000 12779","FMC-300RW-GSRYE","F.01U.012.779","MCP_CONV_820_INDOOR_SURFMT_RESET_YEL","5A",36.16,{"v":174,"d":"174.00"},"on demand","C","A",8536501999,"CN",23,"0.233",{"$nulls":3},"8717332259182"]
[null,"Conventional manual call points for ex areas",null,"",{"$nulls":4},"",{"$nulls":4},"",""]
[null,"6649 980 10934","DKM 2014/2-ex-UGM","4.998.010.934","Ex DKM Type K f UGM-GLT conv manual call point","5A",{"v":1314.87,"d":"1,314.87"},{"$f":"ROUND(ROUND(G349*4.8,2),0)","v":{"v":6311,"d":"6,311.00"}},"no W-Extension","C","A",8536501999,"DE",1,"1.552",{"$nulls":3},8717332019847]
[null,"6649 980 10933","DKM 2014/2-ex","4.998.010.933","double action button, form K, red","5A",{"v":1101.89,"d":"1,101.89"},{"$f":"ROUND(ROUND(G350*4.8,2),0)","v":{"v":5289,"d":"5,289.00"}},"no W-Extension","C","A",8536501999,"DE","","1.527",{"$nulls":3},8717332019830]
[null,"6649 981 12084","DM1103B-Ex","4.998.112.084","DM 1103B-EXP, manual call point, double action, red, connect to ex-barrier SB3","5A",{"v":393,"d":"393.00"},{"v":1886,"d":"1,886.00"},"no W-Extension","C","A",8536501999,"CN",5,"0.333",{"$nulls":3},8717332003648]
[null,"Accessories - manual call points LSN and conventional",null,"",{"$nulls":4},"",{"$nulls":4},"",""]
[null,"6650 000 12951","FMC-FST-DE","F.01U.012.951","FMC-FST-DE Foil set transp","5A",{"v":158,"d":"158.00"},{"$f":"ROUND(ROUND(G353*4.8,2),0)","v":{"v":758,"d":"758.00"}},"no W-Extension","C","A",3919908099,"DE",9,"0.07",null,"-",null,"8717332250202"]
[null,"7750 000 25845","FMC-SPGL-DEIL","F.01U.025.845","Spare glass pane for MCP, 5 glasses","5A",32.51,{"$f":"ROUND(ROUND(G354*4.8,2),0)","v":{"v":156,"d":"156.00"}},"no W-Extension","C","A",70060090,"DE",131,"0.075",{"$nulls":3},8717332252374]
[null,"6649 981 03969","SM210-SPARE-GLASS","4.998.103.969","spare glass, SM 210 LSN RW / SM 120 RW (10 pc)","5A",24.11,{"v":116,"d":"116.00"},"no W-Extension","C","A",70060090,"GB",12,"0.116",null,"-",null,8717332003518]
[null,"6649 980 01364","FMM-plate-blue","4.998.001.364","Insert plate DKM120 blue for test call points","5A",19.04,{"v":91,"d":"91.00"},"no W-Extension","C","A",7610909000,"DE",12,"0.017",null,"-",null,8717332019700]
[null,"6637 566 30007","FMM-KEY-Form G/H","3.756.630.007","Key for Manual Callpoint","5A",1.72,{"$f":"ROUND(ROUND(G357*4.8*1.05,2),0)","v":{"v":9,"d":"9.00"}},"no W-Extension","C","A",85319010,"CN",401,"0.017",null,"-",null,8717332022724]
[null,"7733 022 00737","FMM-SEAL-RED","3.302.200.737","seal red","5A",{"v":15,"d":"15.00"},{"v":72,"d":"72.00"},"no W-Extension","C","A",3926909790,"DE",103,"0.012",null,"-",null,871733209655]
[null,"6649 981 03190","DKM120-LABEL","4.998.103.190","stickers without text for own lettering, 10 foils with 6 pc each (for laser printer)","5A",13.15,{"v":63,"d":"63.00"},"no W-Extension","C","A",3919101990,"DE",22,"0.15","Delivered in packages of 10 pcs. If 30 pcs needed, order 3 pcs.","-",null,8717332003501]
[null,"7050 000 73045","FMC-BEZEL-RD","F.01U.073.045","FMC-BEZEL-RD Bezel for MCP RW, red ","5A",28.87,{"v":139,"d":"139.00"},"no W-Extension","C","A",3926909790,"CN",8,"0.175","Delivered in packages of 4 pcs. If 12 pcs needed, order 3 pcs.",null,null,8717332324859]
[null,"7050 000 73046","FMC-BEZEL-WH","F.01U.073.046","FMC-BEZEL-WH Bezel for MCP RW, white","5A",28.87,{"v":139,"d":"139.00"},"no W-Extension","C","C",3926909790,"CN",0,"0.183","Delivered in packages of 4 pcs. If 12 pcs needed, order 3 pcs.",null,null,8717332324866]
[null,"6650 000 13460","FMC-Spacer-RWRD","F.01U.013.460","FMC-SPACER-RWRD Spacer for MCP RW, red","5A",12.43,{"v":60,"d":"60.00"},"no W-Extension","C","C",3926909790,"CN",0,"0.03",{"$nulls":3},"8717332259304"]
[null,"6650 000 13504","FMC-SPGL-RW","F.01U.013.504","FMC-SPGL-RW Spare glass for MCP RW","5A",{"v":48,"d":"48.00"},{"v":230,"d":"230.00"},"no W-Extension","C","A",70060090,"CN",16,"0.07","Delivered in packages of 5 pcs. If 15 pcs needed, order 3 pcs.",null,null,"8717332259045"]
[null,"6650 000 28195","FMC-SIGN-RW","F.01U.028.195","FMC-SIGN-RW Out of order sign for MCP RW","5A",12.43,{"v":60,"d":"60.00"},"no W-Extension","C","C",3926909790,"CN",0,"0.05",{"$nulls":3},"8717332259601"]
[null,"6650 000 28227","FMC-KEY-RW","F.01U.028.227","FMC-KEY-RW Test key for MCP RW","5A",1.19,{"v":6,"d":"6.00"},"no W-Extension","C","A",3926909790,"CN",440,"0.001",{"$nulls":3},"8717332259724"]
[null,"6650 000 28194","FMC-FLAP-RW","F.01U.028.194","FMC-FLAP-RW clear hinged flap for MCP RW (1 unit= 5 pieces)","5A",17.54,{"v":84,"d":"84.00"},"no W-Extension","C","A",3926909790,"CN",124,"0.099","Delivered in packages of 5 pcs. If 15 pcs needed, order 3 pcs.",null,null,"8717332259595"]
[null,"7050 000 73214","FMC-SEAL-RW","F.01U.073.214","FMC-SEAL-RW Seal for MCP RW","5A",26.31,{"v":126,"d":"126.00"},"no W-Extension","C","C",8309909090,"CN",0,"0.008","Delivered in packages of 100 pcs.if 200 pcs needed, order 2 pcs. (packages). REUP per 100 pcs",null,null,8717332325252]
[null,"LSN interface modules",null,"",{"$nulls":4},"",{"$nulls":4},"",""]
[null,"Series 430",null,"",{"$nulls":4},"",{"$nulls":4},"",""]
["2025-02-10","7050 004 02681","FLM-430-I2M1","F.01U.402.681","Interface module 2 inputs 1 output","5A",218.75,{"$f":"ROUND(ROUND(G370*4.8,2),0)","v":1050},"no W-Extension","C","A",85371098,"PT",null,"0.135",null,"SBN",null,4060039153524]
["2025-02-10","7051 004 02681","FLM-430-SMB","F.01U.402.682","Surface mount box","5A",46.88,{"$f":"ROUND(ROUND(G371*4.8,2),0)","v":225},"no W-Extension","C","A",39269097,"PT",null,"0.317",null,"SBN",null,4060039153531]
["2025-02-10","7052 004 02681","FLM-430-CLIP","F.01U.402.683","DIN clip for interface module","5A",18.75,90,"no W-Extension","C","A",39269097,"PT",null,"0.021","One unit contains 5 clips and 11 screws","SBN",null,4060039153548]
["2025-02-10","7053 004 02681","FLM-430-CABLE","F.01U.402.684","Cable kit for interface module","5A",31.25,150,"no W-Extension","C","A",85444290,"PT",null,"0.034","One unit contains 5 cables","SBN",null,4060039153555]
[null,"Series 420",null,"",{"$nulls":4},"",{"$nulls":4},"",""]
[null,"6650 000 33255","FLM-420-O8I2-S","F.01U.033.255","Interface 8 OC outputs + 2 inputs, surface mount","5A",{"v":218.4,"d":"218.40"},{"$f":"ROUND(ROUND(G375*4.8,2),0)","v":{"v":1048,"d":"1,048.00"}},"on demand","C","A",8517620000,"CN",20,"0.563",{"$nulls":3},8717332288403]
[null,"6650 000 33257","FLM-420-O1I1-E","F.01U.033.257","Interface 1 OC output + 1 input, integration mount","5A",103.81,{"$f":"ROUND(ROUND(G376*4.8,2),0)","v":{"v":498,"d":"498.00"}},"on demand","C","A",8517620000,"CN",532,"0.133",{"$nulls":3},8717332288427]
[null,"6650 000 33256","FLM-420-O1I1-D","F.01U.033.256","Interface 1 OC output + 1 input, DIN rail","5A",128.24,{"v":616,"d":"616.00"},"on demand","C","A",8517620000,"CN",122,"0.316",{"$nulls":3},8717332288410]
[null,"7050 000 80970","FLM-420-RLE-S","F.01U.080.970","Interface for extinguishing panels, surface mount & DIN rail","5A",186.04,{"v":893,"d":"893.00"},"on demand","C","A",8536501999,"CN",169,"0.45",{"$nulls":3},8717332349562]
[null,"6650 000 33247","FLM-420-RLV8-S","F.01U.033.247","Interface 8 relay outputs, surface mount","5A",274.22,{"v":1316,"d":"1,316.00"},"on demand","C",1,8517620000,"CN",355,"0.648",{"$nulls":3},8717332288359]
[null,"6650 000 33251","FLM-420-I8R1-S","F.01U.033.251","Interface 8 inputs, 1 relay output, surface mount","5A",{"v":218.4,"d":"218.40"},{"v":1048,"d":"1,048.00"},"on demand","C",1,8517620000,"CN",498,"0.666",{"$nulls":3},8717332288373]
["2025-02-10","6650 005 08715","FLM-420-NAC-S","F.01U.508.715","Interface output for signaling devices, surface mount","5A",345,{"v":1656,"d":"1,656.00"},"on demand","C",1,8517620000,"CN",256,"0.513",null,"SBN","Product is EOL. Last order: 31.05.2025. Successor info follows",8717332099207]
["2025-02-10","6650 005 08717","FLM-420-NAC-D","F.01U.508.717","Interface output for signaling devices, DIN rail","5A",285,{"v":1368,"d":"1,368.00"},"on demand","C","A",8517620000,"CN",26,"0.196",null,"SBN","Product is EOL. Last order: 31.05.2025. Successor info follows",8717332099221]
[null,"6650 005 08710","FLM-420-RHV-S","F.01U.508.710","Interface 2 high voltage relay outputs + 2 inputs, surface mount","5A",195.17,{"v":937,"d":"937.00"},"on demand","C",1,8517620000,"CN",295,"0.5",null,"SBN",null,8717332099238]
[null,"6650 005 08714","FLM-420-RHV-D","F.01U.508.714","Interface 2 high voltage relay outputs + 2 inputs, DIN rail","5A",177.41,{"v":852,"d":"852.00"},"on demand","C","A",8517620000,"CN",108,"0.324",null,"SBN",null,8717332099252]
[null,"6650 000 12534","FLM-420/4-CON-S","F.01U.012.534","Interface two conventional zones, surface mount","5A",177.41,{"v":852,"d":"852.00"},"on demand","C",1,8517620000,"CN",187,"0.504",{"$nulls":3},8717332250257]
[null,"6650 000 12535","FLM-420/4-CON-D","F.01U.012.535","Interface two conventional zones, DIN rail","5A",170.32,{"v":818,"d":"818.00"},"on demand","C","A",8517620000,"CN",64,"0.115",{"$nulls":3},8717332250264]
[null,"7850 005 08711","FLM-I 420-S","F.01U.508.711","Stand alone short cicuit isolator, surface mount","5A",84.06,{"v":403,"d":"403.00"},"no W-Extension","C","A",8517620000,"CN",16,"0.466",null,"SBN",null,8717332256020]
[null,"6650 000 12542","FLM-420-I2-W","F.01U.012.542","Interface 2 inputs, wall mount","5A",{"v":106.9,"d":"106.90"},{"v":513,"d":"513.00"},"on demand","C","A",8517620000,"CN",34,"0.116",null,"SBN",null,8717332250295]
[null,"6650 000 12571","FLM-420-I2-E","F.01U.012.571","Interface 2 inputs, integration mount","5A",103.81,{"v":498,"d":"498.00"},"on demand","C","A",8517620000,"CN",243,"0.099",null,"SBN",null,8717332250301]
[null,"6650 000 12578","FLM-420-I2-D","F.01U.012.578","Interface 2 inputs, DIN rail","5A",128.24,{"v":616,"d":"616.00"},"on demand","C","A",8517620000,"CN",157,"0.306",null,"SBN",null,8717332250318]
[null,"6650 000 12591","FLM-420-RLV1-E","F.01U.012.591","Interface 1 relay output, integration mount","5A",103.81,{"v":498,"d":"498.00"},"on demand","C","A",8517620000,"CN",582,"0.106",null,"SBN",null,8717332250400]
[null,"6650 000 12594","FLM-420-RLV1-D","F.01U.012.594","Interface 1 relay output, DIN rail","5A",128.24,{"v":616,"d":"616.00"},"on demand","C","A",8517620000,"CN",203,"0.302",null,"SBN",null,8717332250417]
[null,"6650 000 12595","FMX-IFB55-S","F.01U.012.595","Round surface mount box for wall mount","5A",{"v":7.1,"d":"7.10"},{"v":34,"d":"34.00"},"no W-Extension","C","A",3926909790,"CN",39,"0.029",null,"-",null,8717332250424]
[null,"6650 000 29614","FLM-IFB126-S","F.01U.029.614","Square surface mount box for DIN rail modules","5A",{"v":21.3,"d":"21.30"},{"v":102,"d":"102.00"},"no W-Extension","C",1,3926909790,"CN",375,"0.349",null,"-",null,8717332264636]
[null,"7050 000 96884","FLM-420-EOL2W-W","F.01U.096.884","End of line module 2 wire LSN stub, wall mount","5A",82.67,{"v":397,"d":"397.00"},"no W-Extension","C","A",8537109199,"CN",2,"0.12",{"$nulls":3},8717332381395]
[null,"7050 000 83617 ","FLM-420-EOL4W-S","F.01U.083.617","End of line module 4 wire LSN stub, surface mount","5A",165.36,{"v":794,"d":"794.00"},"on demand","C","A",8536501999,"CN",4,"0.48",null,"SBN",null,8717332361090]
[null,"7050 000 83618","FLM-420-EOL4W-D","F.01U.083.618","End of line module 4 wire LSN stub, DIN rail","5A",151.57,{"v":728,"d":"728.00"},"on demand","C","A",8536501999,"CN",0,"0.28",null,"SBN",null,8717332361106]
[null,"Signalling Devices",null,"",{"$nulls":4},"",{"$nulls":4},"",""]
[null,"Addressabl Sounder-Strobe Combination",null,"",{"$nulls":4},"",{"$nulls":4},"",""]
[null,"7050 003 59432","FNX-425U-WFWH","F.01U.359.432","Acoustic/visual alarm wh, wh","5A",{"v":374.11374,"d":"374.11"},{"$f":"ROUND(ROUND(G400*4.8,2),0)","v":{"v":1796,"d":"1,796.00"}},"no W-Extension","C","A","8531103000","DE",42,"0.473","Battery included, White cover not included in delivery",null,null,"4060039071873"]
[null,"7050 003 59433","FNX-425U-RFWH","F.01U.359.433","Acoustic/visual alarm rd, wh","5A",{"v":374.11374,"d":"374.11"},{"$f":"ROUND(ROUND(G401*4.8,2),0)","v":{"v":1796,"d":"1,796.00"}},"no W-Extension","C","A","8531103000","DE",60,"0.473","Battery included, White cover not included in delivery",null,null,"4060039071880"]
[null,"7050 003 59434","FNX-425U-WFRD","F.01U.359.434","Acoustic/visual alarm wh, rd","5A",{"v":374.11374,"d":"374.11"},{"v":1796,"d":"1,796.00"},"no W-Extension","C","A","8531103000","DE",39,"0.473","Battery included. Red cover is included in delivery",null,null,"4060039071897"]
[null,"7050 003 59435","FNX-425U-RFRD","F.01U.359.435","Acoustic/visual alarm rd, rd","5A",{"v":374.11374,"d":"374.11"},{"v":1796,"d":"1,796.00"},"no W-Extension","C","A","8531103000","DE",37,"0.473","Battery included. Red cover is included in delivery",null,null,"4060039071903"]
[null,"7050 003 59438","FNX-425U-BAT","F.01U.359.438","Battery for AVENAR all-in-one 4000","5A",{"v":812.5,"d":"812.50"},{"v":3900,"d":"3,900.00"},"no W-Extension","C","A","8506501090","DE",3,"0.051","1 unit contains 10 batteries. If 20 pcs needed, order 2 unit",null,"Package quantity changed from 30pcs to 10pcs","4060039071934"]
[null,"7050 003 59436","FNX-425U-COVWH","F.01U.359.436","Cover white for AVENAR all-in-one 4000","5A",120.59,{"v":579,"d":"579.00"},"no W-Extension","C","A","8531900000","DE",20,"0.036","1 unit contains 10 covers; if 50 pcs needed, order 5 unit",null,null,"4060039071910"]
[null,"7050 003 59437","FNX-425U-COVRD","F.01U.359.437","Cover red for AVENAR all-in-one 4000","5A",120.59,{"v":579,"d":"579.00"},"no W-Extension","C","A","8531900000","DE",1,"0.036","1 unit contains 10 covers; if 50 pcs needed, order 5 unit",null,null,"4060039071927"]
[null,"Acoustic Signalling Devices",null,"",{"$nulls":4},"",{"$nulls":4},"",""]
[null,"7050 002 68723","FNM-420V-A-RD","F.01U.268.723","LSN Voice Sounder Indoor, Red","5A",188.43,{"$f":"ROUND(ROUND(G408*4.8,2),0)","v":{"v":904,"d":"904.00"}},"no W-Extension","C","A",8531103000,"CN",19,"0.222","Delivery without battery.  Order batteries separately (FNM-BATTERIES; F.01U.168.622 )",null,null,8717332880942]
[null,"7051 002 68724","FNM-420V-A-WH","F.01U.268.724","LSN Voice Sounder Indoor, White","5A",188.43,{"$f":"ROUND(ROUND(G409*4.8,2),0)","v":{"v":904,"d":"904.00"}},"no W-Extension","C","A",8531103000,"CN",12,"0.222","Delivery without battery. Order batteries separately (FNM-BATTERIES; F.01U.168.622 )",null,null,8717332880942]
[null,"7050 001 68575","FNM-420U-A-BSWH","F.01U.168.575","Base Sounder Indoor uninterruptible, wh","5A",159.35,{"v":765,"d":"765.00"},"no W-Extension","C","A",8531103000,"CN",2179,"0.215","Battery is included; Cover is not included",null,null,8717332770762]
[null,"7050 001 68576","FNM-420U-A-BSRD","F.01U.168.576","Base Sounder Indoor uninterruptible, rd","5A",159.35,{"v":765,"d":"765.00"},"no W-Extension","C","A",8531103000,"CN",28,"0.215","Battery is included;  Cover is included",null,null,8717332770779]
[null,"7050 001 68577","FNM-420U-A-RD","F.01U.168.577","Sounder Indoor uninterruptible, red","5A",167.27,{"v":803,"d":"803.00"},"no W-Extension","C","A",8531103000,"CN",348,"0.245",{"$nulls":3},8717332770786]
[null,"7050 001 68578","FNM-420U-A-WH","F.01U.168.578","Sounder Indoor uninterruptible, white","5A",167.27,{"v":803,"d":"803.00"},"no W-Extension","C",1,8531103000,"CN",354,"0.245",{"$nulls":3},8717332770793]
[null,"7050 001 68579","FNM-420U-B-RD","F.01U.168.579","Sounder Outdoor uninterruptible, red","5A",184.34,{"v":885,"d":"885.00"},"no W-Extension","C","A",8531103000,"CN",86,"0.325",{"$nulls":3},8717332770809]
[null,"7050 001 68622","FNM-BATTERIES","F.01U.168.622","Batteries for FNM-420U Sounders (20pcs multipack)","5A",334.54,{"v":1606,"d":"1,606.00"},"no W-Extension","C","A",8531103000,"CN",9,"0.45","Delivered in packages of 20 pcs. If 40 pcs needed, order 2 pcs.",null,null,8717332770823]
[null,"7050 006 64687","FNM-420-A-BS-WH","F.01U.064.687","Base Sounder Indoor, White","5A",132.45,{"v":636,"d":"636.00"},"no W-Extension","C",1,8531103000,"CN",390,"0.198","Cover is not included",null,null,8717332311323]
[null,"7050 006 64688","FNM-420-A-BS-RD","F.01U.064.688","Base Sounder Indoor, Red, LSNimpr.","5A",132.45,{"v":636,"d":"636.00"},"no W-Extension","C",1,8531103000,"CN",105,"0.21","Cover is included",null,null,8717332311330]
[null,"7050 006 64689","FNM-420-A-WH","F.01U.064.689","Sounder Indoor, White","5A",137.91,{"v":662,"d":"662.00"},"no W-Extension","C","A",8531103000,"CN",36,"0.25",{"$nulls":3},8717332311347]
[null,"7050 006 64690","FNM-420-A-RD","F.01U.064.690","Sounder Indoor, Red","5A",137.91,{"v":662,"d":"662.00"},"no W-Extension","C",1,8531103000,"CN",178,"0.216",{"$nulls":3},8717332311354]
[null,"7050 006 64691","FNM-420-B-RD","F.01U.064.691","Sounder Outdoor, Red","5A",161.26,{"v":774,"d":"774.00"},"no W-Extension","C",1,8531103000,"CN",55,"0.299",{"$nulls":3},8717332311361]
[null,"7050 006 64694","FNM-COVER-RD","F.01U.064.694","Cover for Base Sounder, Red","5A",106.68,{"v":512,"d":"512.00"},"no W-Extension","C","A",8531103000,"Slovakia",4,"0.25","Delivered in packages of 10 pcs. If 30 pcs needed, order 3 pcs.",null,null,8717332311392]
[null,"7050 006 64695","FNM-COVER-WH","F.01U.064.695","Cover for Base Sounder, White","5A",106.68,{"v":512,"d":"512.00"},"no W-Extension","C","A",8531103000,"Slovakia",17,"0.25","Delivered in packages of 10 pcs. If 30 pcs needed, order 3 pcs.",null,null,8717332311408]
[null,"7050 006 64692","FNM-SPACER-WH","F.01U.064.692","Spacer for Surf. Cabl., White, FNM-420","5A",166.41,{"v":799,"d":"799.00"},"no W-Extension","C",1,8531103000,"CN",64,"0.49","Delivered in packages of 10 pcs. If 30 pcs needed, order 3 pcs.",null,null,8717332311378]
[null,"7050 006 64693","FNM-SPACER-RD","F.01U.064.693","Spacer for Surf. Cabl., Red, FNM-420","5A",166.41,{"v":799,"d":"799.00"},"no W-Extension","C","A",8531103000,"CN",5,"0.49","Delivered in packages of 10 pcs. If 30 pcs needed, order 3 pcs.",null,null,8717332311385]
[null,"6627 993 50351","DS10-24V","2.799.350.351","DS 10 DIN-tone sounder, 24 V, 110 dB, surface mounted","5A",{"v":548.1,"d":"548.10"},{"v":2631,"d":"2,631.00"},"on demand","C","A",8531900000,"DE",6,"1.935",null,"SBN",null,8717332019199]
[null,"6627 993 50352","DS10-230V","2.799.350.352","DS 10 DIN-tone sounder, 220V 110dB,  surface mounted","5A",585.65,{"v":2811,"d":"2,811.00"},"on demand","C","C",8531900000,"DE",1,"2.217",null,"SBN",null,8717332019205]
[null,"7050 001 43878","FNM-320-SRD","F.01U.143.878","FNM-320-SRD Sounder, Surface-mount, Red","5A",61.87,{"v":297,"d":"297.00"},"no W-Extension","C","A",8531103000,"CN",161,"0.252",{"$nulls":3},8717332494477]
[null,"7050 001 43879","FNM-320-FRD","F.01U.143.879","FNM-320-FRD Sounder, Flush-mount, Red","5A",58.03,{"v":279,"d":"279.00"},"no W-Extension","C","A",8531103000,"CN",31,"0.238",{"$nulls":3},8717332494484]
[null,"7050 001 43880","FNM-320-SWH","F.01U.143.880","FNM-320-SRD Sounder, Surface-mount, Whit","5A",61.87,{"v":297,"d":"297.00"},"no W-Extension","C","A",8531103000,"CN",61,"0.242",{"$nulls":3},8717332494491]
[null,"7050 001 43881","FNM-320-FWH","F.01U.143.881","FNM-320-FRD Sounder, Flush-mount, White","5A",58.03,{"v":279,"d":"279.00"},"no W-Extension","C","A",8531103000,"CN",73,"0.238",{"$nulls":3},8717332494507]
[null,"7050 001 43882","FNM-320LED-SRD","F.01U.143.882","FNM-320LED-SRD Sounder with LED, Surface","5A",133.13,{"v":639,"d":"639.00"},"no W-Extension","C","A",8531103000,"CN",73,"0.292",{"$nulls":3},8717332494514]
[null,"7050 003 93222","PA 10-SSM","F.01U.393.222","Industrial sounder, high","5A",541.38,{"v":2599,"d":"2,599.00"},"no W-Extension","C","A",85318070,"DE",0,"1.060",{"$nulls":3},4060039128270]
[null,"7050 003 93223","PA 5","F.01U.393.223","Industrial sounder, low","5A",325.23,{"v":1561,"d":"1,561.00"},"no W-Extension","C","A",85318070,"DE",1,"0.640",{"$nulls":3},4060039128287]
[null,null,"BexS110D-24 DC","F.01U.426.429","Ex-proof sounder, performance ","5A",{"v":3875,"d":"3,875.00"},{"v":18600,"d":"18,600.00"},"no W-Extension","C","A",85311030,"UK",null,"3.160",{"$nulls":3},4060039201850]
[null,"Optical Signalling Devices",null,"",{"$nulls":4},"",{"$nulls":4},"",""]
[null,"7050 002 88456","SOL-LX-C-WF-W-S","F.01U.288.456","Beacon Ceiling, white flash/ white/ shallow","5A",105.13,{"$f":"ROUND(ROUND(G436*4.8,2),0)","v":{"v":505,"d":"505.00"}},"no W-Extension","C","A",8531103000,"CN",45,"0.105",{"$nulls":3},8717332925155]
[null,"7050 002 88457","SOL-LX-C-RF-W-S","F.01U.288.457","Beacon Ceiling, red flash/ white/ shallow","5A",105.13,{"$f":"ROUND(ROUND(G437*4.8,2),0)","v":{"v":505,"d":"505.00"}},"no W-Extension","C","A",8531103000,"CN",52,"0.105",{"$nulls":3},8717332925162]
[null,"7050 002 88458","SOL-LX-C-WF-W-D","F.01U.288.458","Beacon Ceiling, white flash/ white/deep","5A",105.13,{"v":505,"d":"505.00"},"no W-Extension","C","C",8531103000,"CN",0,"0.136",{"$nulls":3},8717332925179]
[null,"7051 002 88459","SOL-LX-C-RF-W-D","F.01U.288.459","Beacon Ceiling, red flash/ white/deep","5A",105.13,{"v":505,"d":"505.00"},"no W-Extension","C","A",8531103000,"CN",19,"0.136",{"$nulls":3},8717332925186]
[null,"7051 002 88460","SOL-LX-W-WF-W-S","F.01U.288.460","Beacon Wall, white flash /white/shallow","5A",105.13,{"v":505,"d":"505.00"},"no W-Extension","C","A",8531103000,"CN",7,"0.105",{"$nulls":3},8717332925193]
[null,"7051 002 88461","SOL-LX-W-RF-W-S","F.01U.288.461","Beacon Wall, red flash /white/shallow","5A",105.13,{"v":505,"d":"505.00"},"no W-Extension","C","A",8531103000,"CN",4,"0.105",{"$nulls":3},8717332925209]
[null,"7052 002 88462","SOL-LX-W-WF-W-D","F.01U.288.462","Beacon Wall, white flash /white/deep","5A",105.13,{"v":505,"d":"505.00"},"no W-Extension","C","A",8531103000,"CN",10,"0.136",{"$nulls":3},8717332925216]
[null,"7052 002 88463","SOL-LX-W-RF-W-D","F.01U.288.463","Beacon Wall, red flash /white/deep","5A",105.13,{"v":505,"d":"505.00"},"no W-Extension","C","A",8531103000,"CN",13,"0.136",{"$nulls":3},8717332925223]
[null,"7052 002 88464","SOL-LX-W-WF-R-S","F.01U.288.464","Beacon Wall, white flash /red/shallow","5A",105.13,{"v":505,"d":"505.00"},"no W-Extension","C","A",8531103000,"CN",20,"0.105",{"$nulls":3},8717332925230]
[null,"7053 002 88465","SOL-LX-W-RF-R-S","F.01U.288.465","Beacon Wall, red flash /red/shallow","5A",105.13,{"v":505,"d":"505.00"},"no W-Extension","C","A",8531103000,"CN",20,"0.105",{"$nulls":3},8717332925247]
[null,"7053 002 88466","SOL-LX-W-WF-R-D","F.01U.288.466","Beacon Wall, white flash /red/deep","5A",105.13,{"v":505,"d":"505.00"},"no W-Extension","C","A",8531103000,"CN",12,"0.105",{"$nulls":3},8717332925254]
[null,"7053 002 88467","SOL-LX-W-RF-R-D","F.01U.288.467","Beacon Wall, red flash /red/deep","5A",105.13,{"v":505,"d":"505.00"},"no W-Extension","C","A",8531103000,"CN",61,"0.136",{"$nulls":3},8717332925261]
[null,"7050 001 24386","FNS-P400RTH-R","F.01U.124.386","Rotating Beacon Red","5A",232.81,{"v":1117,"d":"1,117.00"},"no W-Extension","C","A",85318070,"DE",1,"0.818",{"$nulls":3},8717332402854]
[null,"7050 001 24387","FNS-P400RTH-Y","F.01U.124.387","Rotating Beacon Yellow","5A",232.81,{"v":1117,"d":"1,117.00"},"no W-Extension","C","A",85318070,"DE",1,"0.801",{"$nulls":3},8717332402861]
[null,"7050 001 43883","FNS-320-SRD","F.01U.143.883","FNS-320-SRD Beacon, Surface-mount, Red","5A",74.68,{"v":358,"d":"358.00"},"no W-Extension","C","A",8531103000,"CN",47,"0.216",{"$nulls":3},8717332494521]
[null,"7050 001 43884","FNS-320-SYE","F.01U.143.884","FNS-320-SYE Beacon, Surface-mount, Amber","5A",74.68,{"v":358,"d":"358.00"},"no W-Extension","C","A",8531103000,"CN",10,"0.172",{"$nulls":3},8717332494538]
[null,"7050 001 43885","FNS-320-SWH","F.01U.143.885","FNS-320-SWH Beacon, Surface-mount, White","5A",74.68,{"v":358,"d":"358.00"},"no W-Extension","C","A",8531103000,"CN",4,"0.291",{"$nulls":3},8717332494545]
[null,"7050 001 43886","FNS-320-SGR","F.01U.143.886","FNS-320-SGR Beacon, Surface-mount, Green","5A",74.68,{"v":358,"d":"358.00"},"no W-Extension","C","A",8531103000,"CN",2,"0.291",{"$nulls":3},8717332494552]
[null,"6650 005 16089","FNS-420-R","F.01U.516.089","Strobe for base sounder red","5A",{"v":128.9,"d":"128.90"},{"v":619,"d":"619.00"},"on demand","C","A",8531900000,"CN",274,"0.077",null,null,"Not allowed for fire applications within the EU.",8717332282999]
[null,"7050 001 32440","FNA-P400RBA-MB","F.01U.132.440","Mounting Bracket for FNS-P400RTH","5A",59.91,{"v":288,"d":"288.00"},"no W-Extension","C","A",3926909790,"DE",1,"0.095",{"$nulls":3},8717332457519]
[null,"7050 003 93220","PY X-M-10-SSM R","F.01U.393.220","Industrial strobe SSM, red","5A",499.01,{"v":2395,"d":"2,395.00"},"no W-Extension","C","A",85318070,"DE",0,"0.440",{"$nulls":3},4060039128256]
[null,"7050 003 93221","PY X-M-10-SSM W","F.01U.393.221","Industrial strobe SSM, white","5A",499.01,{"v":2395,"d":"2,395.00"},"no W-Extension","C","A",85318070,"DE",3,"0.440",{"$nulls":3},4060039128263]
[null,"Optical + Acoustical Signalling Devices Combination",{"$nulls":6},"",{"$nulls":4},"",""]
[null,"7050 002 88468","ROLP-W-LX-W-WF","F.01U.288.468","Sounder Beacon, white /wall/white flash","5A",152.92,{"$f":"ROUND(ROUND(G459*4.8,2),0)","v":{"v":734,"d":"734.00"}},"no W-Extension","C","A",8531103000,"CN",24,"0.283",{"$nulls":3},8717332925278]
[null,"7050 002 88469","ROLP-W-LX-W-RF","F.01U.288.469","Sounder Beacon, white/wall/red flash","5A",152.92,{"$f":"ROUND(ROUND(G460*4.8,2),0)","v":{"v":734,"d":"734.00"}},"no W-Extension","C","A",8531103000,"CN",25,"0.283",{"$nulls":3},8717332925285]
[null,"7050 002 88470","ROLP-R-LX-W-WF","F.01U.288.470","Sounder Beacon, red/wall/white flash","5A",152.92,{"v":734,"d":"734.00"},"no W-Extension","C","A",8531103000,"CN",39,"0.283",{"$nulls":3},8717332925292]
[null,"7050 002 88471","ROLP-R-LX-W-RF","F.01U.288.471","Sounder Beacon, red/wall/red flash","5A",152.92,{"v":734,"d":"734.00"},"no W-Extension","C","A",8531103000,"CN",160,"0.283",{"$nulls":3},8717332925308]
[null,"Test Equipments",null,"",{"$nulls":4},"",{"$nulls":4},"",""]
[null,"6650 005 08720","FAA-500-RTL","F.01U.508.720","FAA-500-RTL removal tool","5A",{"v":1071.93,"d":"1,071.93"},{"$f":"ROUND(ROUND(G464*4.8,2),0)","v":{"v":5145,"d":"5,145.00"}},"no W-Extension","C","A",8205598000,"GB",0,"0.785",null,"SBN",null,"8717332097692"]
[null,"6650 005 08725","FAA-500-TTL","F.01U.508.725","FAA-TTL Test adapter with magnet  ","5A",475.75,{"$f":"ROUND(ROUND(G465*4.8,2),0)","v":{"v":2284,"d":"2,284.00"}},"no W-extension","S","A",3926909790,"GB",2,"0.116",null,"SBN",null,"8717332097708"]
[null,"7050 003 63162","SOLO461","F.01U.363.162","Cordless heat detector test kit","5A",{"v":1906.58,"d":"1,906.58"},{"v":9152,"d":"9,152.00"},"no W-Extension","C","A",3926909790,"GB",1,"2.35",null,"SBN",null,4060039081209]
[null,"6649 981 12071","SOLO330","4.998.112.071","Test device for optical smoke detectors","5A",535.36,{"v":2570,"d":"2,570.00"},"no W-Extension","C","A",3926909790,"GB",5,"0.73",null,"SBN",null,8717332003600]
[null,"7050 003 45557","FME-SOLO-A10S","F.01U.345.557","Test Aerosol spray for Optical Smoke Detectors","5A",73.34,{"v":352,"d":"352.00"},"no W-Extension","C","A",4911990000,"GB",439,"0.24","Order only 12 pcs or multiple of 12. E.g. needed 30 pcs, order 36 pcs","-",null,4060039009142]
[null,"7050 003 01469","FME-TEST-CO","F.01U.301.469","Spray with CO testing gas for multisensor detectors with C-component","5A",{"v":78.7,"d":"78.70"},{"v":378,"d":"378.00"},"no W-Extension","C","A",3824840000,"GB",51,"0.05",null,"-",null,8717332955183]
[null,"6649 981 12073","SOLO610","4.998.112.073","Carry bag for Solo service kit","5A",356.52,{"v":1711,"d":"1,711.00"},"no W-Extension","C","A",4202929890,"GB",5,"2.52",null,"-",null,8717332020447]
[null,"7050 003 63163","SOLO770","F.01U.363.163","SOLO770 Spare battery- pack","5A",387.52,{"v":1860,"d":"1,860.00"},"no W-Extension","C","A",3926909790,"GB","","0.466",null,"SBN",null,4060039081216]
[null,"6649 981 12113","SOLO200","4.998.112.113","Universal detector removal tool without pole","5A",714.22,{"v":3428,"d":"3,428.00"},"no W-Extension","C","A",8205598000,"GB",1,"1.221",null,"SBN",null,8717332003679]
[null,"6649 981 12069","SOLO100","4.998.112.069","Extension pole for detector removal tool - 1-3,4m","5A",{"v":1310.4,"d":"1,310.40"},{"v":6290,"d":"6,290.00"},"no W-Extension","C","A",3926909790,"GB",4,"1.04","In US the product is called SOLO 100, in other countries SOLO106-126, see changed datasheet","SBN",null,8717332003587]
[null,"6649 981 12070","SOLO101","4.998.112.070","Fibreglass extension rod (1m)","5A",273.05,{"v":1311,"d":"1,311.00"},"no W-Extension","C","A",3926909790,"GB",10,"0.38",null,"SBN",null,8717332003594]
[null,"6649 980 82502","RTL-cap","4.998.082.502","Plastic cap for detector removal tool, 2 pcs are needed","5A",{"v":31,"d":"31.00"},{"v":149,"d":"149.00"},"no W-Extension","C","A",3926909790,"GB",3,"0.083",null,"-",null,8717332020089]
[null,705000169803,"FME-420-LSN-TTL","F.01U.169.803","LSN improved Test Tool","5A",{"v":4895.88,"d":"4,895.88"},{"v":23500,"d":"23,500.00"},"no W-Extension","C","C",90303900,"DE",4,"5.092",{"$nulls":3},8717332774494]
[null,"Fire Service Control Panel and Door Control Units",{"$nulls":6},"",{"$nulls":4},"",""]
[null,"Fire Service Control Panel",null,"",{"$nulls":4},"",{"$nulls":4},"",""]
[null,705000288669,"FMF-ADP-TTY","F.01U.288.669","Fire Brigade Peripheral Ring Bus Module TTY interface","5A",541.64,{"$f":"ROUND(ROUND(G479*4.8,2),0)","v":{"v":2600,"d":"2,600.00"}},"no W-Extension","C","C",8538909999,"DE",11,"0.184",null,"-",null,8717332925537]
[null,705000317733,"FMF-ADP-FBF","F.01U.317.733","Fire Brigade Peripheral Ring Bus Module for UEZ-2000 and BZ-500","5A",739.26,{"$f":"ROUND(ROUND(G480*4.8,2),0)","v":{"v":3548,"d":"3,548.00"}},"no W-Extension","C","C",8538909999,"DE",0,0.2,null,"-",null,8717332541201]
[null,"F.01U.288.674","FMF-FBF-FAT","F.01U.288.674","Fire Brigade Peripheral FAT and FBF","5A",{"v":1493.89,"d":"1,493.89"},{"v":7171,"d":"7,171.00"},"no W-Extension","C","C",8531103000,"DE",3,3.72,null,"-","only German version",8717332925582]
[null,"F.01U.288.675","FMF-ESPA","F.01U.288.675","ESPA interface","5A",224.28,{"v":1077,"d":"1,077.00"},"no W-Extension","C","C",8531103000,"DE",0,0.14,null,"-",null,8717332925599]
[null,"F.01U.288.676","FMF-FIBS-A4","F.01U.288.676","Fire brigade information center A4","5A",{"v":2595.4,"d":"2,595.40"},{"v":12458,"d":"12,458.00"},"no W-Extension","C","C",8531103000,"DE",0,17.74,null,"-","only German version",8717332925605]
[null,"F.01U.288.677","FMF-FIBS-A3","F.01U.288.677","Fire brigade information center A3","5A",{"v":2595.4,"d":"2,595.40"},{"v":12458,"d":"12,458.00"},"no W-Extension","C","C",8531103000,"DE",0,24,null,"-","only German version",8717332925612]
[null,"F.01U.288.706","FMF-FAT","F.01U.288.706","Fire Brigade Peripheral FAT","5A",{"v":1068.04,"d":"1,068.04"},{"v":5127,"d":"5,127.00"},"no W-Extension","C","C",8531103000,"DE",0,2.2,null,"-","only German version",8717332925735]
[null,"Accessories Fire Service Control Panel",null,"",{"$nulls":4},"",{"$nulls":4},"",""]
[null,"not in MFG","SD-A","2.799.360.424","FSK-A, with housing","5A",493.53,{"$f":"ROUND(ROUND(G487*4.8,2),0)","v":{"v":2369,"d":"2,369.00"}},"no W-Extension","C","C",8531900000,"NL",0,"0.828",null,null,"only German version"]
[null,665000033702,"FMS-KR-BASIC-RPF","F.01U.033.702","Key deposit Kruse FSD 2003 12/24V-Rain","5A",{"v":2126.23,"d":"2,126.23"},{"$f":"ROUND(ROUND(G488*4.8,2),0)","v":{"v":10206,"d":"10,206.00"}},"no W-Extension","C","D",8303009000,"DE",0,"12.623",null,null,"only German version",8717332289899]
[null,"6650 000 33703","FMS-KR-BASIC","F.01U.033.703","Key deposit Kruse FSD 2003 12/24V","5A",{"v":1720.44,"d":"1,720.44"},{"v":8258,"d":"8,258.00"},"no W-Extension","C","D",8303009000,"DE",0,"14.0",null,null,"only German version",8717332289905]
[null,"not in MFG","BS DKM/FIPS","4.998.149.388","BS for installation DKM in FIBS","5A",{"v":99,"d":"99.00"},{"v":475,"d":"475.00"},"no W-Extension","C","A",7326909890,"DE",1,"0.125",null,null,"only German version",""]
[null,"Door Control Unit",null,"",{"$nulls":4},"",{"$nulls":4},"",""]
[null,"6627 993 30300","TSZ 0400 LSN","2.799.330.300","TSZ 0400 Door control unit","5A",541.23,{"$f":"ROUND(ROUND(G92*4.8,2),0)","v":{"v":24588,"d":"24,588.00"}},"no W-Extension","C","A",8531900000,"DE",5,"0.642",null,null,"only German version",8717332020836]
[null,"6627 993 20540","FMD-432","2.799.320.540","Push button type 432 flush-mount","5A",63.85,{"$f":"ROUND(ROUND(G93*4.8,2),0)","v":{"v":16670,"d":"16,670.00"}},"no W-Extension","C","A",8536501999,"DE",3,"0.1",null,null,"only German version",8717332019038]
[null,"6627 993 20541","FMD-432-S","2.799.320.541","TYPE 432 PUSH BUTTON FOR SURFACE MOUNTING","5A",38.31,{"v":44453,"d":"44,453.00"},"no W-Extension","C","A",8536501999,"DE",8,"0.083",null,null,"only German version",8717332020829]
[null,"6627 993 20503","FMD-F.GT60","2.799.320.503","ASS65 ANCHOR PLATE FOR GT60","5A",78.25,{"v":24588,"d":"24,588.00"},"no W-Extension","C","A",8505902999,"DE",4,"0.27",null,null,"only German version",8717332002962]
[null,"6627 993 20504","FMD-GT60","2.799.320.504","GT60R DOOR HOLD MAGNET 24V/686N, WALL MOUNTING ","5A",243.24,{"v":16670,"d":"16,670.00"},"no W-Extension","C","A",8505902999,"DE",4,"0.48",null,null,"only German version",8717332002948]
[null,"6627 993 20532","FMD-GT50","2.799.320.532","GT50R DOOR HOLD MAGNET 24V/490N, FLOOR MOUNTING","5A",447.83,{"v":2399,"d":"2,399.00"},"no W-Extension","C","A",8505902999,"DE",1,"0.59",null,null,"only German version",8717332002979]
[null,"6627 993 20536","FMD-F.GT50","2.799.320.536","ASS55 ANCHOR PLATE FOR GT50","5A",59.06,{"v":1675,"d":"1,675.00"},"no W-Extension","C","A",8505909090,"DE",2,"0.098",null,null,"only German version",8717332019021]
[null,"6627 993 20539","FMD-GT50-space","2.799.320.539","GT50R WITH SPACER PIPE DOOR HOLD MAGNET, UNIV","5A",413.97,0,"no W-Extension","C","A",8505909090,"DE",1,"1.41",null,null,"only German version",8717332002986]
[null,"Training ","","",{"$nulls":4},"",{"$nulls":4},""]
[null,null,"TRA-FIR-FL","F.01U.328.621","Training Fire Alarm Systems","T3",{"v":900,"d":"900.00"},{"$f":"ROUND(ROUND(G501*4.8,2),0)","v":{"v":4320,"d":"4,320.00"}},"no W-Extension","n.a.","n.a.","n.a.","n.a","n.a.","No physical product",null,null,"Price per person for 1 training / local, customized training organized by BU",8717332951796]
[null,null,"TRA-FPA-FE","F.01U.350.356","Training FPA-5000 - Expert","T3",{"v":600,"d":"600.00"},{"$f":"ROUND(ROUND(G502*4.8,2),0)","v":{"v":2880,"d":"2,880.00"}},"no W-Extension","n.a.","n.a.","n.a.","n.a","n.a.","No physical product",null,null,"Price per person for a 2-day FPA training / organized by BU",4060039025128]
[null,null,"TRA-FPA-FM","F.01U.350.357","Training FPA-5000 - Master","T3",{"v":600,"d":"600.00"},{"v":2880,"d":"2,880.00"},"no W-Extension","n.a.","n.a.","n.a.","n.a","n.a.","No physical product",null,null,"Price per person for a 2-day FPA training / organized by BU",4060039025135]

{"sheet":"Fire EN 54 FX 4,704","index":6,"n_rows":500,"n_cols":19,"rows_kept":500,"hidden":true}
["Change Indicator",null,"BU Fire reference REUP List Q3-4 / 2025   -   V1.3"]
[null,"12 NC","CTN","SAPnumber","Description","Discount Category","REUP EMEA valid 01.07.2025","FX=4,704 REUP PL valid 01.07.2025","Warranty Extension","Status","ABC Code","HS Code","Country of Origin","Spike order","Net weight \n(kg)","Order Info","Repair process","Remarks","EAN code single"]
[null,"Modular Panel"]
[null,"Modules FPA-5000 and AVENAR Panels"]
[null,"7050 000 81384","BCM-0000-B","F.01U.081.384","BCM 0000 B  Battery Controller Module","5A",215.92,{"$f":"ROUND(ROUND(G5*4.704,2),0)","v":{"v":1016,"d":"1,016.00"}},"on demand","C",1,8537109199,"CN",148,"0.342",null,"SBN",null,800549180153]
[null,"6649 981 37262","ANI 0016 A","4.998.137.262","ANI 0016 A  16 Point Annunciator internal","5A",129.56,{"$f":"ROUND(ROUND(G6*4.704,2),0)","v":{"v":609,"d":"609.00"}},"on demand","C","A",8537109199,"CN",7,"0.26",null,"SBN",null,8717332205882]
[null,"6649 981 37265","RML 0008 A","4.998.137.265","RML 0008 A  Relay Low Voltage","5A",172.73,{"v":813,"d":"813.00"},"on demand","C",1,8537109199,"CN",98,"0.306",null,"SBN",null,8717332205912]
["x","6649 981 37266","IOS 0020 A","4.998.137.266","IOS 0020 A  20mA Communication Module","5A",{"v":470,"d":"470.00"},{"v":2211,"d":"2,211.00"},"on demand","C",1,8537109199,"CN",15,"0.594",null,"SBN",null,8717332205929]
[null,"6649 981 37267","IOS 0232 A","4.998.137.267","IOS 0232 A  RS232 Communication Module","5A",259.11,{"v":1219,"d":"1,219.00"},"on demand","C","A",8537109199,"CN",4,"0.233",null,"SBN",null,8717332205936]
[null,"6649 981 37269","IOP 0008 A","4.998.137.269","IOP 0008 A  8 input/output OC module","5A",237.16,{"v":1116,"d":"1,116.00"},"on demand","C",1,8537109199,"CN",17,"0.299",null,"SBN",null,8717332205943]
[null,"6649 981 37270","CZM 0004 A","4.998.137.270","CZM 0004 A  4 Zone Conventional Zone Module","5A",468.24,{"v":2203,"d":"2,203.00"},"on demand","C",1,8537109199,"CN",52,"0.333",null,"SBN",null,8717332205950]
[null,"7050 000 63204","ENO 0000 B","F.01U.063.204","ENO 0000 B (External Notification)","5A",345.47,{"v":1625,"d":"1,625.00"},"on demand","C",1,8537109199,"CN",79,"0.27",null,"SBN",null,800549134231]
[null,"6649 981 37274","RMH 0002 A","4.998.137.274","RMH 0002 A  2 Zone Relay high voltage","5A",395.27,{"v":1859,"d":"1,859.00"},"on demand","C","A",8537109199,"CN",15,"0.31",null,"SBN",null,8717332205998]
[null,"6649 981 37275","NZM 0002 A","4.998.137.275","NZM 0002 A  2 Zone NAC Zone Module","5A",345.47,{"v":1625,"d":"1,625.00"},"on demand","C",1,8537109199,"CN",37,"0.306",null,"SBN",null,8717332206001]
[null,"6650 000 28289","FPE-5000-UGM","F.01U.028.289","UGM interface module","5A",456.01,{"v":2145,"d":"2,145.00"},"no W-Extension","C","A",8537109199,"CN",32,"0.27",null,"SBN",null,8717332260041]
[null,"6649 981 37277","LSN 0300 A","4.998.137.277","LSN 0300 A  LSN Module","5A",504.72,{"v":2374,"d":"2,374.00"},"on demand","C",1,8538909999,"CN",462,"0.306",null,"SBN",null,8717332206018]
[null,"6649 981 37278","LSN 1500 A","4.998.137.278","LSN 1500 A, LSN improved Module","5A",{"v":1003.36,"d":"1,003.36"},{"v":4720,"d":"4,720.00"},"on demand","C","A",8538909999,"CN",27,"0.68",null,"SBN",null,8717332309719]
[null,"6649 981 37279","PRS-0002-C","F.01U.284.903","PRS-0002-C  Panel Rail Short","5A",58.58,{"v":276,"d":"276.00"},"no W-Extension","C","A",8536901000,"CN",165,"0.45",null,"SBN",null,8717332206025]
[null,"6649 981 37280","PRD 0004 A","4.998.137.280","PRD 0004 A  Panel Rail long","5A",146.83,{"v":691,"d":"691.00"},"no W-Extension","C",1,8536901000,"CN",129,"0.72",null,"SBN",null,8717332206032]
[null,"AVENAR Panel 8000 ",null,"",{"$nulls":4},"",{"$nulls":4},"",""]
[null,"7050 003 27090","FPE-8000-SPC","F.01U.327.090","Panel controller, standard license","5A",839.18,{"$f":"ROUND(ROUND(G21*4.704,2),0)","v":{"v":3948,"d":"3,948.00"}},"on demand","C","A",8537109199,"PT",24,3.191,null,"SBN",null,8717332940417]
[null,"7050 003 52441","FPE-8000-PPC","F.01U.352.441","Panel controller, premium license","5A",{"v":1441.2,"d":"1,441.20"},{"$f":"ROUND(ROUND(G22*4.704,2),0)","v":{"v":6779,"d":"6,779.00"}},"on demand","C","A",8537109199,"PT",27,3.191,null,"SBN",null,4060039031174]
[null,"Housings for Frame Installation AVENAR Panel 8000",null,"",{"$nulls":4},"",{"$nulls":4},"",""]
[null,"6649 981 37290","CPH 0006 A","4.998.137.290","CPH 0006 A  Backbox CABT 1 rail","5A",514.09,{"$f":"ROUND(ROUND(G24*4.704,2),0)","v":{"v":2418,"d":"2,418.00"}},"no W-Extension","C",1,8538909999,"CN",68,"12.34",null,"SBN",null,8717332206131]
[null,"6649 981 37291","MPH 0010 A","4.998.137.291","MPH 0010 A  Backbox CABT 2 Rails","5A",647.75,{"$f":"ROUND(ROUND(G25*4.704,2),0)","v":{"v":3047,"d":"3,047.00"}},"no W-Extension","C",1,8538909999,"CN",74,"13.85",null,"SBN",null,8717332206148]
[null,"6649 981 37292","EPH 0012 A","4.998.137.292","EPH 0012 A  Backbox 3 rails","5A",{"v":1100.66,"d":"1,100.66"},{"v":5178,"d":"5,178.00"},"no W-Extension","C",1,8538909999,"CN",21,"14.55",null,"SBN",null,8717332206155]
[null,"6649 981 37293","PSF 0002 A","4.998.137.293","PSF 0002 A  Power-small-frame","5A",347.33,{"v":1634,"d":"1,634.00"},"no W-Extension","C",1,8538909999,"CN",54,"7.723",null,"SBN",null,8717332206162]
[null,"6650 005 11306","PMF 0002 A","F.01U.511.306","PMF 0002 A  Power-medium-frame","5A",{"v":350.4,"d":"350.40"},{"v":1648,"d":"1,648.00"},"no W-Extension","C","A",3926909790,"CN",124,"12.726",null,"SBN",null,8717332206667]
[null,"6649 981 37294","PMF 0004 A","4.998.137.294","PMF 0004 A  Power-medium-frame","5A",401.54,{"v":1889,"d":"1,889.00"},"no W-Extension","C",1,8538909999,"CN",64,"12.132",null,"SBN",null,8717332206179]
[null,"6649 981 47119","USF 0000 A","4.998.147.119","USF 0000 A  Universal housing-small-frame","5A",334.16,{"v":1572,"d":"1,572.00"},"no W-Extension","C","A",8538909999,"CN",13,"7.489",null,"SBN",null,8717332206315]
[null,"6649 981 37296","FBH 0000 A","4.998.137.296","FBH 0000 A  Mounting frame large","5A",{"v":174.8,"d":"174.80"},{"v":822,"d":"822.00"},"no W-Extension","C",1,3926909790,"CN",500,"4.822",null,"SBN",null,8717332206193]
[null,"6649 981 37297","FMH 0000 A","4.998.137.297","FMH 0000 A  Mounting frame medium","5A",128.52,{"v":605,"d":"605.00"},"no W-Extension","C",1,3926909790,"CN",150,"4.137",null,"SBN",null,8717332206209]
[null,"6649 981 37298","FSH 0000 A","4.998.137.298","FSH 0000 A  Mounting frame small","5A",102.83,{"v":484,"d":"484.00"},"no W-Extension","C","A",3926909790,"CN",20,"2.362",null,"SBN",null,8717332206216]
[null,"7050 002 66845","FPM-5000-KMC","F.01U.266.845","mounting kit for media converter","5A",434.44,{"v":2044,"d":"2,044.00"},"no W-Extension","C","A",85189000,"DE",7,"0.86",null,"SBN",null,8717332875269]
[null,"6650 005 11305","HMP 0003 A","F.01U.511.305","HMP 0003 A, installation plate for mounting frame","5A",129.56,{"v":609,"d":"609.00"},"no W-Extension","C","A",3926909790,"CN",8,"0.383",null,"SBN",null,8717332206650]
[null,"6649 981 39498","FRB 0019 A","4.998.139.498","FRB 0019 A  19\" Frame Rack X Rails","5A",138.19,{"v":650,"d":"650.00"},"no W-Extension","C","A",7326909890,"CN",10,"4.813",null,"SBN",null,8717332206278]
[null,"6649 981 39499","FRM 0019 A","4.998.139.499","FRM 0019 A  19\" Frame Rack X Rails","5A",107.96,{"v":508,"d":"508.00"},"no W-Extension","C","A",7326909890,"CN",4,"4.778",null,"SBN",null,8717332206285]
[null,"6649 981 39500","FRS 0019 A","4.998.139.500","FRS 0019 A  19\" Frame Rack X Rails","5A",{"v":95,"d":"95.00"},{"v":447,"d":"447.00"},"no W-Extension","C","A",3926909790,"CN",3,"3.14",null,"SBN",null,8717332206292]
[null,"6650 005 00374","FDP 0001 A","F.01U.500.374","FDP 0001 A    Front Dummy cover plate","5A",17.27,{"v":81,"d":"81.00"},"no W-Extension","C",1,3926909790,"CN",737,"0.1",null,"SBN",null,8717332206605]
[null,"6650 005 13251","FPO-5000-EB","F.01U.513.251","FPO-5000-EB earth bar ","5A",86.37,{"v":406,"d":"406.00"},"no W-Extension","C","A",7326909890,"CN",31,"0.111",null,"SBN",null,8717332206766]
[null,"Housings for Wall Mounting AVENAR Panel 8000",null,"",{"$nulls":4},"",{"$nulls":4},"",""]
[null,"6649 981 37285","HCP 0006 A","4.998.137.285","HCP 0006 A  CABT 1 Rail & Common Control","5A",431.84,{"$f":"ROUND(ROUND(G42*4.704,2),0)","v":{"v":2031,"d":"2,031.00"}},"no W-Extension","C",1,8529904900,"CN",64,"13.581",null,"SBN",null,8717332206087]
[null,"6649 981 37286","HBC 0010 A","4.998.137.286","HBC 0010 A  CABT 2 Rails & Common Control","5A",647.75,{"$f":"ROUND(ROUND(G43*4.704,2),0)","v":{"v":3047,"d":"3,047.00"}},"no W-Extension","C",1,8529904900,"CN",13,"17.11",null,"SBN",null,8717332206094]
[null,"6649 981 37287","HBE 0012 A","4.998.137.287","HBE 0012 A  CABT 3 Rails","5A",{"v":1100.66,"d":"1,100.66"},{"v":5178,"d":"5,178.00"},"no W-Extension","C","A",8529904900,"CN",7,"18.144",null,"SBN",null,8717332206100]
[null,"6649 981 37288","PSS 0002 A","4.998.137.288","PSS 0002 A  CABT 1 power Slot 2 batterys","5A",477.38,{"v":2246,"d":"2,246.00"},"no W-Extension","C","A",3926909790,"CN",8,"7.452",null,"SBN",null,8717332206117]
[null,"6649 981 37289","PSB 0004 A","4.998.137.289","PSB 0004 A  CABT 1 power Slot 4 batterys","5A",647.75,{"v":3047,"d":"3,047.00"},"no W-Extension","C","A",3926909790,"CN",10,"12.511",null,"SBN",null,8717332206124]
[null,"6650 005 11304","FRK 0019 A","F.01U.511.304","FRK 0019 A 19 inches fixing kit","5A",287.49,{"v":1352,"d":"1,352.00"},"no W-Extension","C","A",7326909890,"DE",1,"2.34",null,"SBN",null,8717332263493]
[null,"7050 002 66844","FPM-5000-KES","F.01U.266.844","FPM-5000-KES mounting kit for Ethernet switch","5A",766.64,{"v":3606,"d":"3,606.00"},"no W-Extension","C","A",8302500000,"DE",5,"2.77",null,"SBN",null,8717332875252]
[null,"7050 002 65641","EL1141-10B-BH","F.01U.265.641","EL1141-10B-BH Ethernet Fibre Optics Converter MM","5A",925.96,{"v":4356,"d":"4,356.00"},"no W-Extension","C","A",8504409090,"TW",31,"0.58",null,"SBN",null,8717332871018]
[null,"7050 002 65643","EL1141-B0B-BH","F.01U.265.643","EL1141-10B-BH Ethernet Fibre Optics Converter SM","5A",{"v":1286.56,"d":"1,286.56"},{"v":6052,"d":"6,052.00"},"no W-Extension","C","A",8504409090,"TW",23,"0.58",null,"SBN",null,8717332871032]
[null,"Power Supplies AVENAR Panel 8000",{"$nulls":6},"",{"$nulls":4},"",""]
[null,"6650 005 00367","UPS 2416 A","F.01U.500.367","UPS 2416 Power Supply 24V/6A NAC sync","5A",{"v":423.2,"d":"423.20"},{"$f":"ROUND(ROUND(G52*4.704,2),0)","v":{"v":1991,"d":"1,991.00"}},"on demand","C",1,8504403090,"CN",1250,"0.97",null,"SBN",null,8717332206582]
[null,"6649 981 53243","CPB 0000 A","4.998.153.243","CPB 0000 A  Cable set P-Supply to BC ","5A",21.59,{"$f":"ROUND(ROUND(G53*4.704,2),0)","v":{"v":102,"d":"102.00"}},"no W-Extension","C","A",8544429090,"CN",700,"0.198",null,"SBN",null,8717332206520]
[null,"7050 000 78858","FPO-5000-PSB1","F.01U.078.858","PSB 1001 A  P-Supply Bracket US single ","5A",{"v":95,"d":"95.00"},{"v":447,"d":"447.00"},"no W-Extension","C","A",3926909790,"CN",12,"1.03",null,"SBN",null,8717332342655]
[null,"7050 000 78860","FPO-5000-PSB-CH","F.01U.078.860","CPB 1002 A  P-Supply Bracket CH US","5A",120.92,{"v":569,"d":"569.00"},"no W-Extension","C",1,3926909790,"CN",375,"0.798",null,"SBN",null,8717332342679]
[null,705000398453,"FPP-3000","F.01U.398.453","Power Supply","5A",583.56,{"v":2745,"d":"2,745.00"},"no W-Extension","C","A",85044055,"PL",23,{"v":11,"d":"11.000"},null,"SBN",null,4060039146991]
[null,"6650 005 11307","FPP 5000","F.01U.511.307","FPP 5000, AUX power supply kit","5A",{"v":1174.59,"d":"1,174.59"},{"v":5525,"d":"5,525.00"},"no W-Extension","C","B",8504900500,"NL",20,"20.7",null,"RC",null,8717332206674]
[null,"7050 001 61679","FPP-5000-TI13","F.01U.161.679","LSN interface for FPP-5000","5A",174.42,{"v":820,"d":"820.00"},"on demand","C","A",8531900000,"CN",111,"0.306",{"$nulls":3},8717332754281]
[null,"Cable Sets FPA-5000 / AVENAR Panel 8000",{"$nulls":6},"",{"$nulls":4},"",""]
[null,"6649 981 53244","CBB 0000 A","4.998.153.244","CBB 0000 A  Cable set BC to Battery","5A",28.07,{"$f":"ROUND(ROUND(G60*4.704,2),0)","v":{"v":132,"d":"132.00"}},"no W-Extension","C",1,8544429090,"CN",788,"0.198",null,"SBN",null,8717332206537]
[null,"7050 003 49391","FPE-8000-CRP","F.01U.349.391","Cable set redundant panel controller","5A",72.97,{"$f":"ROUND(ROUND(G61*4.704,2),0)","v":{"v":343,"d":"343.00"}},"no W-Extension","C","A",8544429090,"PT",13,0.642,null,"SBN",null,4060039022608]
[null,"7050 003 49392","FPE-8000-CRK","F.01U.349.392","Cable redundant keypad","5A",43.78,{"v":206,"d":"206.00"},"no W-Extension","C","A",8544429090,"PT",25,0.258,null,"SBN",null,4060039022615]
[null,"Display Panels",{"$nulls":6},"",{"$nulls":4},"",""]
[null,"6649 980 00922","BAT 100 LSN","4.998.000.922","BAT100 LSN, Remote display panel","5A",577.83,{"$f":"ROUND(ROUND(G64*4.704,2),0)","v":{"v":2718,"d":"2,718.00"}},"on demand","C","A",8537109199,"DE",3,"2.61",null,"SBN","One ATG-420-LSNi is included",8717332004584]
[null,8717332915347,"ATB 420 LSNi","F.01U.284.611","ATB 420 LSNi for the connection to location map tableaus","5A",353.27,{"$f":"ROUND(ROUND(G65*4.704,2),0)","v":{"v":1662,"d":"1,662.00"}},"on demand","C","A",8538909189,"DE",11,"0.07",null,"SBN",null,8717332915347]
[null,"6649 980 01941","BAT100-LABELS","4.998.001.941","BS labeling strips for BAT 100","5A",87.21,{"v":410,"d":"410.00"},"no W-Extension","C","C",3919908099,"DE",2,"0.266",null,"SBN",null,8717332019816]
[null,8531901000,"ATG 420 LSNI","F.01U.284.610","ATG 420 LSNi display module","5A",353.27,{"v":1662,"d":"1,662.00"},"on demand","C","C",8531209590,"CN",9,"0.055",null,"SBN",null,8717332915330]
[null,"not in MFG","ATG100-LABEL","3.902.102.662","BS labeling membranes ATG 100","5A",46.96,{"v":221,"d":"221.00"},"no W-Extension","C","C",3919908099,"DE",10,"0.349",null,"-",null,""]
[null,"Accessories FPA-5000 / AVENAR Panel 8000",{"$nulls":6},"",{"$nulls":4},""]
[null,"6650 005 00374","FDP 0001 A","F.01U.500.374","FDP 0001 A    Front Dummy cover plate","5A",17.27,{"$f":"ROUND(ROUND(G70*4.704,2),0)","v":{"v":81,"d":"81.00"}},"no W-Extension","C",1,3926909790,"CN",737,"0.1",null,"SBN",null,8717332206605]
[null,"6650 005 00442","SIV 28","F.01U.500.442","SIV 28V Fuse protected distributor           ","5A",117.87,{"$f":"ROUND(ROUND(G71*4.704,2),0)","v":{"v":554,"d":"554.00"}},"no W-Extension","C","A",8531900000,"DE",5,"0.22",null,"SBN",null,8717332212309]
[null,null,"ESP-EF01U390166","F.01U.390.166","SPA Cable NTC-Resistor Magic-Panel","5A",58.63,{"v":276,"d":"276.00"},"no W-Extension","C","A",85334010,"China",null,"0.001",null,"No repair",null,4060039122308]
[null,"Remote Keypad for AVENAR Panel Series",null,"",{"$nulls":4},"",{"$nulls":4},"",""]
[null,"7050 003 27092","FPE-8000-FMR","F.01U.327.092","Remote Keypad","5A",{"v":1477.68,"d":"1,477.68"},{"v":6951,"d":"6,951.00"},"on demand","C","A",8537109199,"PT",22,3.121,null,"SBN",null,8717332940431]
[null,"AVENAR Panel 2000 Series",null,"",{"$nulls":4},"",{"$nulls":4},"",""]
[null,"7050 003 27091","FPE-2000-SPC","F.01U.327.091","Panel controller AVENAR panel 2000, standard license","5A",839.18,{"v":3948,"d":"3,948.00"},"on demand","C","A",8537109199,"PT",28,3.191,null,"SBN",null,8717332940424]
[null,"7050 003 52443","FPE-2000-PPC","F.01U.352.443","Panel controller AVENAR panel 2000, premium license","5A",{"v":1441.2,"d":"1,441.20"},{"v":6779,"d":"6,779.00"},"on demand","C","A",8537109199,"PT",18,3.191,null,"SBN",null,4060039031181]
[null,"7050 003 83886","FPA-2000-SWM","F.01U.383.886","Panel kit standard license, wall-mount","5A",{"v":1756.2,"d":"1,756.20"},{"$f":"ROUND(ROUND(G78*4.704*1.05,2),0)","v":{"v":8674,"d":"8,674.00"}},"no W-Extension","C","A",8537109199,"PT",0,19.7,null,"SBN",null,4060039107411]
[null,"7050 003 83887","FPA-2000-SFM","F.01U.383.887","Panel kit standard license, frame-mount","5A",{"v":1888.24,"d":"1,888.24"},{"$f":"ROUND(ROUND(G79*4.704*1.05,2),0)","v":{"v":9326,"d":"9,326.00"}},"no W-Extension","C","A",8537109199,"PT",5,22.8,null,"SBN",null,4060039107428]
[null,"7050 003 83888","FPA-2000-PWM","F.01U.383.888","Panel kit premium license, wall-mount","5A",{"v":2304.13,"d":"2,304.13"},{"$f":"ROUND(ROUND(G80*4.704*1.05,2),0)","v":{"v":11381,"d":"11,381.00"}},"no W-Extension","C","A",8537109199,"PT",0,19.7,null,"SBN",null,4090039107435]
[null,"7050 003 83893","FPA-2000-PFM","F.01U.383.893","Panel kit premium license, frame-mount","5A",{"v":2430.37,"d":"2,430.37"},{"$f":"ROUND(ROUND(G81*4.704*1.05,2),0)","v":{"v":12004,"d":"12,004.00"}},"no W-Extension","C","A",8537109199,"PT",2,22.8,null,"SBN",null,4060039107442]
[null,"BACNet Server License",{"$nulls":6},"",{"$nulls":4},""]
["2025-05-07","7050 004 28678","FSM-8000-BNSL","F.01U.428.678","BACnet server license 5 years","5A",{"v":2000,"d":"2,000.00"},{"v":9408,"d":"9,408.00"},"no W-Extension",null,"C","n.a.","DE",null,"n.a.",null,"n.a.",null,4060039205827]
["2025-05-07","7051 004 28679","FSM-8000-BNSTL","F.01U.428.679","BACnet server trial license 30 days","5A",{"v":45,"d":"45.00"},{"v":212,"d":"212.00"},"no W-Extension",null,"C","n.a.","DE",null,"n.a.",null,"n.a.",null,4060039205834]
[null,"Remote Serive",{"$nulls":6},"",{"$nulls":4},""]
["2025-05-07","n.a.","FPO-GATE","F.01U.433.333","Secure Network Gateway","5A",{"v":937.5,"d":"937.50"},{"v":4410,"d":"4,410.00"},"no W-Extension","C","A",8517620000,"DE",3,1.127,{"$nulls":3},4060039034250]
["2025-06-25","n.a.","FSL-BASIC-S","F.01U.435.428","NEXOSPACE FSE basic license S","5A",{"v":312,"d":"312.00"},{"v":1468,"d":"1,468.00"},"no W-Extension","C","n.a.",4911990000,"Germany",0,0,"Annual connectivity license <254 points","No physical product",null,4060039104076]
["2025-06-25","n.a.","FSL-BASIC-M","F.01U.435.594","NEXOSPACE FSE basic license M","5A",{"v":940,"d":"940.00"},{"v":4422,"d":"4,422.00"},"no W-Extension","C","n.a.",4911990000,"Germany",0,0,"Annual connectivity license 254 - 2000 points","No physical product",null,4060039112699]
["2025-06-25","n.a.","FSL-BASIC-L","F.01U.435.590","NEXOSPACE FSE basic license L","5A",{"v":1562,"d":"1,562.00"},{"v":7348,"d":"7,348.00"},"no W-Extension","C","n.a.",4911990000,"Germany",0,0,"Annual connectivity license > 2000 points","No physical product",null,4060039111692]
[null,"Fire Monitoring System",null,"",{"$nulls":4},"",{"$nulls":4},"",""]
[null,"7050 003 14991","FSM-5000","F.01U.314.991","Fire Monitoring System 5000","5A",{"v":5224.94,"d":"5,224.94"},{"v":24578,"d":"24,578.00"},"no W-Extension","C","C",4911990000,"IT",{"v":0,"d":"0.000"},"0.001","Sold only in SEO. Outphased  for rest EMEA","No repair","Sold only in SEO. Outphased  for rest EMEA",8717332995257]
[null,"7050 003 14990","FSM-2500","F.01U.314.990","Fire Monitoring System 2500","5A",{"v":3542.34,"d":"3,542.34"},{"v":16663,"d":"16,663.00"},"no W-Extension","C","C",4911990000,"IT",0,"0.001","Sold only in SEO. Outphased  for rest EMEA","No repair","Sold only in SEO. Outphased  for rest EMEA",8717332995240]
[null,null,"FSM-10K","F.01U.374.278","Fire Monitoring System 10000","5A",{"v":9446.22,"d":"9,446.22"},{"v":44435,"d":"44,435.00"},"no W-Extension","C","C",4911990000,"IT","","0.001","Cannot be sold in SEO","No repair","Cannot be sold in SEO",4060039091192]
[null,null,"FSM-5000","F.01U.374.695","Fire Monitoring System 5000","5A",{"v":5224.94,"d":"5,224.94"},{"v":24578,"d":"24,578.00"},"no W-Extension","C","C",4911990000,"IT",{"v":0,"d":"0.000"},"0.001","Cannot be sold in SEO","No repair","Cannot be sold in SEO",4060039091437]
[null,null,"FSM-2500","F.01U.374.694","Fire Monitoring System 2500","5A",{"v":3542.34,"d":"3,542.34"},{"v":16663,"d":"16,663.00"},"no W-Extension","C","C",4911990000,"IT",{"v":0,"d":"0.000"},"0.001","Cannot be sold in SEO","No repair","Cannot be sold in SEO",4060039091420]
[null,"7050 003 14992","FSM-5000-EP","F.01U.314.992","Evolution pack FSM-5000","5A",509.86,{"v":2398,"d":"2,398.00"},"no W-Extension","C","C",4911990000,"IT",0,"0.001",null,"No repair",null,8717332995264]
[null,"7050 003 15067","FSM-2500-EP","F.01U.315.067","Evolution pack FSM-2500","5A",356.03,{"v":1675,"d":"1,675.00"},"no W-Extension","C","C",4911990000,"IT",0,"0.001",null,"No repair",null,8717332995288]
[null,"Conventional panels",null,"",{"$nulls":4},"",{"$nulls":4},"",""]
[null,705000164791,"FPC-500-2","F.01U.164.791","2 zone conventional fire panel","5A",389.41,{"v":1832,"d":"1,832.00"},"on demand","C","A",8531103000,"CN",15,"2.2",{"$nulls":3},8717332759385]
[null,705000164792,"FPC-500-4","F.01U.164.792","4 zone conventional fire panel","5A",479.96,{"v":2258,"d":"2,258.00"},"on demand","C","A",8531103000,"CN",20,"3.456",{"$nulls":3},8717332759392]
[null,705000164793,"FPC-500-8","F.01U.164.793","8 zone conventional fire panel","5A",600.71,{"v":2826,"d":"2,826.00"},"on demand","C","A",8531103000,"CN",14,"3.42",{"$nulls":3},8717332759408]
[null,705000164794,"FPC-500-OCEXT","F.01U.164.794","Optional open collector board","5A",45.29,{"v":213,"d":"213.00"},"no W-Extension","C","A",8531900000,"CN",1,"0.1",{"$nulls":3},8717332759415]
[null,705000164795,"FPC-500-RLYEXT","F.01U.164.795","Optional relay board","5A",84.52,{"v":398,"d":"398.00"},"no W-Extension","C","A",8531900000,"CN",10,"0.1",{"$nulls":3},8717332759422]
[null,705000164844,"FPC-500-KEY","F.01U.164.844","Optional access key level 2","5A",30.19,{"v":142,"d":"142.00"},"no W-Extension","C","A",3926909790,"CN",8,"0.01",{"$nulls":3},8717332759859]
[null,"Batteries",null,"",{"$nulls":4},"","",null,null,""]
[null,"Batteries ",null,"",{"$nulls":4},"","",null,null,""]
[null,null,"IPS-BAT12V-12AH","F.01U.579.778","Battery 12 V / 10 - 12 Ah",null,null,0,{"$nulls":6},"3.730"]
[null,null,"IPS-BAT12V-27AH","F.01U.579.781","Battery 12 V / 24 - 27 Ah",null,null,0,{"$nulls":6},"7.96"]
[null,null,"IPS-BAT12V-45AH","F.01U.579.782","Battery 12 V / 38 - 45 Ah",null,null,0,{"$nulls":6},"13.520"]
[null,"LSN Detectors",null,"",{"$nulls":4},"",{"$nulls":4},"",""]
[null,"500 Series",null,"",{"$nulls":4},"",{"$nulls":4},"",""]
[null,"6650 005 10149","FAP-O 520","F.01U.510.149","FAP-O 520 opt smoke detector LSNi white","5A",201.11,{"v":946,"d":"946.00"},"on demand","C","A",8531103000,"CN",112,"0.170",null,"SBN",null,8717332265121]
[null,"6650 005 10151","FAP-OC 520","F.01U.510.151","FAP-OC 520 Multisensor detector LSNi wh","5A",321.86,{"v":1514,"d":"1,514.00"},"on demand","C","A",8531103000,"CN",23,"0.180",null,"SBN",null,8717332265138]
[null,"6650 005 10161","FAP-O 520-P","F.01U.510.161","FAP-O 520-P opt smoke detector LSNi tr","5A",227.94,{"v":1072,"d":"1,072.00"},"on demand","C","A",8531103000,"CN",20,"0.170",null,"SBN",null,8717332265190]
[null,"6650 005 10162","FAP-OC 520-P","F.01U.510.162","FAP-OC 520-P Multisens detector LSNi tr","5A",328.71,{"v":1546,"d":"1,546.00"},"on demand","C","A",8531103000,"CN",15,"0.180",null,"SBN",null,8717332265213]
[null,"AVENAR Detector 4000",null,"",{"$nulls":4},"",{"$nulls":4},"",""]
[null,"7050 003 07726","FAP-425-O-R","F.01U.307.726","Optical with Rotary-Switches","5A",88.97,{"$f":"ROUND(ROUND(G117*4.704*0.72,2),0)","v":{"v":301,"d":"301.00"}},"on demand","C","A",8531103000,"PT",12911,"0.077",null,"SBN",null,8717332972968]
[null,"7050 003 07728","FAP-425-OT-R","F.01U.307.728","Optical/Thermal with Rotary-Switches","5A",103.23,{"$f":"ROUND(ROUND(G118*4.704*0.72,2),0)","v":{"v":350,"d":"350.00"}},"on demand","C","A",8531103000,"PT",10961,"0.077",null,"SBN",null,8717332972982]
[null,"7050 003 07732","FAH-425-T-R","F.01U.307.732","Heat with Rotary-Switches","5A",81.06,{"$f":"ROUND(ROUND(G119*4.704*0.82,2),0)","v":{"v":313,"d":"313.00"}},"on demand","C","A",8531103000,"PT",1050,"0.077",null,"SBN",null,8717332973026]
[null,"7050 003 07729","FAP-425-DO-R","F.01U.307.729","Dual-Optical with Rotary-Switches","5A",96.16,{"$f":"ROUND(ROUND(G120*4.704*0.72,2),0)","v":{"v":326,"d":"326.00"}},"on demand","C","A",8531103000,"PT",2238,"0.077",null,"SBN",null,8717332972999]
[null,"7050 003 07730","FAP-425-DOT-R","F.01U.307.730","Dual-Optical/Thermal with Rotary-Switches","5A",111.35,{"$f":"ROUND(ROUND(G121*4.704*0.72,2),0)","v":{"v":377,"d":"377.00"}},"on demand","C","A",8531103000,"PT",2407,"0.077",null,"SBN",null,8717332973002]
[null,"7050 003 07731","FAP-425-DOTC-R","F.01U.307.731","Dual-Optical/Thermal/Chemical with Rotary-Switches","5A",186.08,{"$f":"ROUND(ROUND(G122*4.704*0.75,2),0)","v":{"v":656,"d":"656.00"}},"on demand","C","A",8531103000,"PT",275,"0.082",null,"SBN",null,8717332973019]
[null,"7050 003 95473","FAP-425-DOTCO-R","F.01U.395.473","Detector dual-optical/thermal/CO","5A",186.08,{"$f":"ROUND(ROUND(G123*4.704*0.75,2),0)","v":{"v":656,"d":"656.00"}},"on demand","C","A",8531103000,"PT",null,"0,082",null,"SBN",null,"4060039133199"]
[null,"7050 003 07725","FAP-425-O","F.01U.307.725","Optical without Rotary-Switches","5A",86.04,{"$f":"ROUND(ROUND(G124*4.704*0.72,2),0)","v":{"v":291,"d":"291.00"}},"on demand","C","A",8531103000,"PT",4365,"0.075",null,"SBN",null,8717332972951]
[null,"7050 003 07727","FAP-425-OT","F.01U.307.727","Optical/Thermal without Rotary-Switches","5A",101.09,{"$f":"ROUND(ROUND(G125*4.704*0.72,2),0)","v":{"v":342,"d":"342.00"}},"on demand","C","A",8531103000,"PT",1688,"0.075",null,"SBN",null,8717332972975]
[null,"Accessories 500/400/300 series detectors",null,"",{"$nulls":4},"",{"$nulls":4},"",""]
[null,"Accessories for FAP-500 Series",null,"",{"$nulls":4},"",{"$nulls":4},"",""]
[null,"6650 005 08713","FAA-500-CB","F.01U.508.713","FAA-500-CB, built-in housing for concrete ceiling","5A",72.22,{"v":340,"d":"340.00"},"no W-Extension","C","B",3926909790,"DE",9,"0.2",null,"-",null,4060039033000]
[null,"6649 981 51297","FAA-500","4.998.151.297","FAA500, base LSN","5A",53.55,{"v":252,"d":"252.00"},"no W-Extension","C","A",8536909599,"CN",174,"0.25",null,"SBN",null,8717332097494]
[null,"6649 981 51302","FAA-500-BB","4.998.151.302","FAA-500-BB, mount back box","5A",15.21,{"v":72,"d":"72.00"},"no W-Extension","C","A",3926909790,"CN",192,"0.166",null,"SBN",null,8717332097487]
[null,"6649 981 51296","FAA-500-TR-P","4.998.151.296","FAA-500-TR-P, transperant iris with color insert","5A",24.02,{"v":113,"d":"113.00"},"no W-Extension","C","A",3926909790,"CN",20,"0.049",null,"SBN",null,8717332097562]
[null,"6649 981 51295","FAA-500-TR-W","4.998.151.295","Trim ring for 500 Series, iris white","5A",6.04,{"v":28,"d":"28.00"},"no W-Extension","C","A",3926909790,"CN",151,"0.03",null,"SBN",null,8717332097555]
[null,"6650 005 10166","FAA-500-SB-H","F.01U.510.166","FAA-500-SB-H Surface mount back box with damp room seal ","5A",13.28,{"v":62,"d":"62.00"},"no W-Extension","C","A",3926909790,"CN",38,"0.266",null,"SBN",null,"8717332204748"]
[null,"6650 005 10028","FAA-500-SPRING","F.01U.510.028","FAA-500-SPRING for concrete / wooden ceilings","5A",9.25,{"v":44,"d":"44.00"},"no W-Extension","C","A",7320208990,"CN",10,"0.116","Price per piece. Order only 10 pcs or multiple of 10. E.g. needed 30 pcs, order 30 pcs","-",null,"8717332204793"]
[null,"6649 981 51299","FAA-500-R","4.998.151.299","FAA-500-R base LSN with relay","5A",53.53,{"$f":"ROUND(ROUND(G135*4.704,2),0)","v":{"v":252,"d":"252.00"}},"no W-Extension","C","A",8536909599,"CN",2,"0.24",null,"SBN",null,"8717332283224"]
[null,"Accessories for 300 and 400 series",null,"",{"$nulls":4},"",{"$nulls":4},"",""]
[null,"6650 005 08658","FAA-MSR420","F.01U.508.658","FAA-420-R Base with Relay for 420 Series","5A",42.52,{"v":200,"d":"200.00"},"no W-Extension","C","A",8536909599,"CN",28,"0.09",null,"SBN",null,"8717332206896"]
[null,"6649 980 21535","MS 400","4.998.021.535","MS 400, socket, surface/ flush mounted cable supply","5A",5.45,{"$f":"ROUND(ROUND(G138*4.704*1.28,2),0)","v":{"v":33,"d":"33.00"}},"no W-Extension","C",1,8536909599,"CN",3162,"0.009",null,"SBN",null,8717332019878]
[null,"7050 002 15139","MS 400 B","F.01U.215.139","MS 400 Detector Base with Bosch Logo","5A",5.11,{"$f":"ROUND(ROUND(G139*4.704*1.37,2),0)","v":{"v":33,"d":"33.00"}},"no W-Extension","C","A",8536909599,"CN",11606,"0.09",null,"SBN",null,8717332019878]
[null,"7050 002 15142","FAA-420-SEAL","F.01U.215.142","FAA-420-SEAL Damp Room Seal MS400 (10ps)","5A",122.48,{"v":576,"d":"576.00"},"no W-Extension","C","A",8536909599,"CN",38,"0.23","One package unit contains 10 pcs. E.g. 50 pcs needed --> order 5","SBN",null,8717332808830]
[null,"6649 981 13025","MSC 420","4.998.113.025","MSC 420 Add base surface-mount","5A",6.92,{"v":33,"d":"33.00"},"no W-Extension","C","A",3926909790,"CN",944,"0.1",null,"-",null,8717332020461]
[null,"6649 981 14565","MSR 320","4.998.114.565","MSR 320 GLT, Base with Relay","5A",30.24,{"v":142,"d":"142.00"},"no W-Extension","C",1,8536909599,"CN",254,"0.04",null,"SBN",null,8717332022519]
[null,"6649 980 25369","SK 400","4.998.025.369","SK 400, Metal cage for protection MagicSens detectors","5A",48.37,{"v":228,"d":"228.00"},"no W-Extension","C","A",7326909890,"DE",39,"0.3",null,"SBN",null,8717332003266]
[null,"6649 980 35312","SSK400","4.998.035.312","SSK 400, dust cover (10ps)","5A",26.05,{"v":123,"d":"123.00"},"no W-Extension","C","A",3926909790,"DE",123,"0.21","One package unit contains 10 pcs. E.g. 50 pcs needed --> order 5","SBN",null,8717332003310]
[null,"6649 980 84709","TP4 400","4.998.084.709","TP4 400, lettering strip till 4 m hight, (Attention!!! Order multiple, read comment)","5A",0.53,{"v":2,"d":"2.00"},"no W-Extension","C","A",3926909790,"DE",4597,"0.006","Order only 50 pcs or multiple of 50. E.g. needed 150 pcs, order 150 pcs","-",null,8717332003396]
[null,"6649 980 84710","TP8 400","4.998.084.710","TP8 400, lettering strip till 8 m hight, (Attention!!! Order multiple, read comment)","5A",0.56,{"v":3,"d":"3.00"},"no W-Extension","C","A",3926909790,"DE",879,"0.009","Order only 50 pcs or multiple of 50. E.g. needed 150 pcs, order 150 pcs","-",null,8717332003402]
[null,"6649 980 25373","MH 400",4998025373,"MH 400, detector heating","5A",48.63,{"v":229,"d":"229.00"},"no W-Extension","C","A",8531900000,"DE",15,"0.017",null,"-",null,8717332003280]
[null,"6649 980 97924","WA400","4.998.097.924","MK 400, detector console including socket","5A",{"v":43.2,"d":"43.20"},{"v":203,"d":"203.00"},"no W-Extension","C","A",3926909790,"DE",33,"0.199",null,"-",null,8717332003426]
[null,"7050 002 89620","FAA-420-RI-DIN","F.01U.289.620","Remote Indicator","5A",46.93,{"v":221,"d":"221.00"},"no W-Extension","C",1,8531900000,"PT",175,"0.061",null,"SBN",null,8717332927982]
[null,"7050 002 89120","FAA-420-RI-ROW","F.01U.289.120","Remote Indicator","5A",15.63,{"v":74,"d":"74.00"},"no W-Extension","C","A",8531900000,"PT",1155,"0.058",null,"SBN",null,8717332926756]
[null,"6627 992 71257","FMX-DET-MB","2.799.271.257","MOUNT BRACKfalse floor mounting bracket","5A",{"v":24.8,"d":"24.80"},{"v":117,"d":"117.00"},"no W-Extension","C","A",3926909790,"DE",84,"0.09",null,"-",null,8717332018994]
[null,"7050 002 39554","FAA-420-CAP-V0","F.01U.239.554","Detector cap, V0 rating (200 pcs)","5A",425.68,{"v":2002,"d":"2,002.00"},"no W-Extension","C","C","85369095","CN",0,"0.023","One unit contains 200 pcs. Minimum order quantity is 5 units (= 1.000 caps). Delivery time 3-4 months.","-","Mainly used for Israel",8717332822423]
[null,"7050 002 14891","MS 400 V0","F.01U.214.891","Detector base, V0 rating","5A",10.16,{"v":48,"d":"48.00"},"no W-Extension","C","C","85369095","CN",0,"0.081",null,"-","Mainly used for Israel",8717332808199]
[null,"Conventional detectors",null,"",{"$nulls":4},"",{"$nulls":4},"",""]
[null,"320 Series",null,"",{"$nulls":4},"",{"$nulls":4},"",""]
[null,"7050 000 26293","FCP-O320","F.01U.026.293","FCP-O320 optical conventional (820Ω)","5A",40.12,{"v":189,"d":"189.00"},"on demand","C","A",8531103000,"CN",690,"0.072",null,"SBN",null,8717332253180]
[null,"7050 000 26292","FCP-OC320","F.01U.026.292","FCP-OC 320 optical/ chemical conv. det. (820Ω)","5A",176.63,{"v":831,"d":"831.00"},"on demand","C","A",8531103000,"CN",23,"0.1",null,"SBN",null,8717332253173]
[null,"7050 000 26295","FCP-OT320","F.01U.026.295","FCP-OT 320 optical/ heat conv. Detector (820Ω)","5A",69.11,{"v":325,"d":"325.00"},"on demand","C","A",8531103000,"CN",113,"0.09",null,"SBN",null,8717332253210]
[null,"7050 000 26291","FCH-T320","F.01U.026.291","FCH-T 320 conv. RoR heat detector (820Ω)","5A",30.67,{"v":144,"d":"144.00"},"on demand","C","A",8531103000,"CN",134,"0.069",null,"SBN",null,8717332253166]
[null,"7050 000 26294","FCH-T320-FSA","F.01U.026.294","FCH-T 320-FSA Heat, RoR conv. Detector (820Ω)","5A",60.04,{"v":282,"d":"282.00"},"on demand","C","A",8531103000,"CN",2,"0.09",null,"SBN",null,8717332253203]
[null,"7850 000 29857","FCP-O320-R470","F.01U.029.857","FCP-O 320-R470 optical smoke detector (470Ω)","5A",40.12,{"v":189,"d":"189.00"},"on demand","C","A",8531900000,"CN",31,"0.09",null,"SBN",null,800549091664]
[null,"7850 000 29867","FCP-OC320-R470","F.01U.029.867","FCP-OC 320-R470 Combined opt/gas det. (470Ω)","5A",176.63,{"v":831,"d":"831.00"},"on demand","C","A",8531103000,"CN",2,"0.09",null,"SBN",null,800549091718]
[null,"7850 000 29862","FCP-OT320-R470","F.01U.029.862","FCP-OT 320-R470 optical/heat detector (470Ω)","5A",69.11,{"v":325,"d":"325.00"},"on demand","C","A",8531103000,"CN",4,"0.091",null,"SBN",null,800549091701]
[null,"7850 000 29861","FCH-T320-R470","F.01U.029.861","FCH-T 320-R470 heat detector (470Ω)","5A",30.67,{"v":144,"d":"144.00"},"on demand","C","A",8531103000,"CN",4,"0.099",null,"SBN",null,800549091695]
[null,"7050 000 83619","FLM-320-EOL2W","F.01U.083.619","FLM-320-EOL2W Conv EOL Module 2-Wire","5A",33.55,{"v":158,"d":"158.00"},"no W-Extension","C","A",8537109199,"CN",24,"0.03",null,"SBN",null,800549189309]
[null,705000083620,"FLM-320-EOL4W-S","F.01U.083.620","FLM-320-EOL4W-S Conv EOL Module 4-Wire","5A",147.57,{"v":694,"d":"694.00"},"on demand","C","A",8536501999,"CN",3,"0.48",null,"SBN",null,8717332361120]
[null,"500 Series",null,"",{"$nulls":4},"",{"$nulls":4},"",""]
[null,"7850 005 10647","FCA-500-EU","F.01U.510.647","FCA-500-EU base conventional for EU","5A",62.18,{"v":292,"d":"292.00"},"no W-Extension","C","A",8536909599,"CN",40,"0.218",null,"SBN",null,8717332251490]
[null,"7850 005 10648","FCA-500-E-EU","F.01U.510.648","FCA-500-E-EU base conv-EOL for EU","5A",{"v":76,"d":"76.00"},{"v":358,"d":"358.00"},"no W-Extension","C","A",8536909599,"CN",7,"0.25",null,"SBN",null,8717332256228]
[null,"7850 005 12649","FCP-O 500","F.01U.510.649","FCP-O 500 conv opt smoke detector EU wh","5A",310.93,{"v":1463,"d":"1,463.00"},"on demand","C",1,8531103000,"CN",75,"0.308",null,"SBN",null,8717332251445]
[null,"7850 005 10653","FCP-OC 500","F.01U.510.653","FCP-OC 500 Multisens detect conv EU wh","5A",449.12,{"v":2113,"d":"2,113.00"},"on demand","C","A",8531103000,"CN",10,"0.217",null,"SBN",null,8717332251469]
[null,"7850 005 10654","FCP-O 500-P","F.01U.510.654","FCP-O 500-P conv opt smoke det EU tr","5A",324.75,{"v":1528,"d":"1,528.00"},"on demand","C","A",8531103000,"CN",10,"0.36",null,"SBN",null,8717332251476]
[null,"7850 005 10656","FCP-OC 500-P","F.01U.510.656","FCP-OC 500-P conv multisen detect EU tr","5A",462.94,{"v":2178,"d":"2,178.00"},"on demand","C","A",8531103000,"CN",1,"0.35",null,"SBN",null,8717332251483]
[null,"Detectors for explosive areas",null,"",{"$nulls":4},"",{"$nulls":4},"",""]
[null,"7050 002 79764","016519","F.01U.279.764","Flameproof (Exd) IR3 Flame Detector","5A",{"v":8616.02,"d":"8,616.02"},{"v":40530,"d":"40,530.00"},"no W-Extension","C","A",8531103000,"GB",3,"2.5",null,"SBN",null,8717332906369]
[null,705000332582,"OOH740-A9-EX","F.01U.332.582","Dual-optical detector, explosive area","5A",558.24,{"v":2626,"d":"2,626.00"},"no W-Extension","C","A",85311030000,"CH",23,"0.124",null,"SBN",null,4260451081447]
[null,705000332583,"FDB201","F.01U.332.583","Base for Dual-Optical Detector for Ex Area","5A",33.49,{"v":158,"d":"158.00"},"no W-Extension","C","A",85319085900,"CH",24,"0.025",null,"SBN",null,4260451081454]
[null,705000335165,"FDB291","F.01U.335.165","Base attachment","5A",24.81,{"v":117,"d":"117.00"},"no W-Extension","C","A",85319000000,"CH",11,"0.036",null,"SBN",null,4260451089573]
[null,705000335589,"FDB295","F.01U.335.589","Base attachment wet","5A",95.52,{"v":449,"d":"449.00"},"no W-Extension","C","A",85319000000,"CN",10,"0.286",null,"SBN",null,4060039000002]
[null,705000335595,"FDB295M","F.01U.335.595","Metal cable gland","5A",54.59,{"v":257,"d":"257.00"},"no W-Extension","C","A",90269000900,"CH",27,"0.354","1 bag contains 10 pcs.20 pcs needed, order 2 pcs. (bags) REUP per unit (= 10 pcs)","SBN",null,4060039000064]
[null,705000335593,"FDUD291","F.01U.335.593","Detector exchanger","5A",{"v":2133.7,"d":"2,133.70"},{"v":10037,"d":"10,037.00"},"no W-Extension","C","A",90318080000,"CH",0,"0.480",null,"SBN",null,4060039000040]
[null,705000335590,"FDBZ291","F.01U.335.590","Designation plate","5A",2.49,{"v":12,"d":"12.00"},"no W-Extension","C","A",85319000000,"CH",13,"0.024","Order only 10 pcs or multiple of 10. E.g. needed 30 pcs, order 30 pcs","SBN",null,4060039000019]
[null,705000335591,"FDBZ293","F.01U.335.591","Detector locking device","5A",0.98,{"v":5,"d":"5.00"},"no W-Extension","C","A",85319000000,"CH",0,"0.026","Order only 100 pcs or multiple of 100. E.g. needed 60 pcs, order 100 pcs","SBN",null,4060039000026]
[null,705000335592,"FDBZ295","F.01U.335.592","Sealing element","5A",19.85,{"v":93,"d":"93.00"},"no W-Extension","C","A",40169300900,"CH",3,"0.037",null,"SBN",null,4060039000033]
[null,705000335594,"FDZ291","F.01U.335.594","Detector dust cap","5A",3.72,{"v":18,"d":"18.00"},"no W-Extension","C","A",85319000000,"CH",4,"0.045","Order only 10 pcs or multiple of 10. E.g. needed 30 pcs, order 30 pcs","SBN",null,4060039000057]
[null,"6649 981 12085","SB3","4.998.112.085","SB3, Safety barrier (including input/output module DCA1192)","5A",917.99,{"v":4318,"d":"4,318.00"},"no W-Extension","C","A",8536909599,"DE",15,"1.19",null,"SBN",null,8717332003655]
[null,"6649 981 15785","DOW1171-ident","4.998.115.785","DBZ1193A,  DOW1171 Det identifier","5A",1.89,{"v":9,"d":"9.00"},"no W-Extension","C","A",{"v":8310000000,"d":"8310000000.00"},"CH",3,0,"Price per piece. Order only 10 pcs or multiple of 10. E.g. needed 30 pcs, order 30 pcs.","SBN",null,8717332020478]
[null,"Video-based Fire Detection",null,"",{"$nulls":4},"",{"$nulls":4},"",""]
[null,"7050 004 06348","FCS-8000-VFD-I","F.01U.406.348","AI-VFD Bullet 4MP 4.4-10mm IP67","5A",{"v":7089.08,"d":"7,089.08"},{"v":33347,"d":"33,347.00"},"on demand","C","A",85258900,"PT",null,"3.285",null,"SBN",null,4060039159519]
[null,"7050  003 17536","FCS-8000-VFD-B","F.01U.317.536","AVIOTEC IP starlight 8000","5A",{"v":7089.08,"d":"7,089.08"},{"v":33347,"d":"33,347.00"},"on demand","C","A",8525801931,"PT",44,"1.196",null,"SBN",null,8717332541010]
[null,"Wireless Devices",null,"",{"$nulls":4},"",{"$nulls":4},"",""]
[null,"66F01U349134","FWI-270","F.01U.349.134","Radio gateway","5A",{"v":1088.56,"d":"1,088.56"},{"v":5121,"d":"5,121.00"},"no W-Extension","C","B",8517620000,"PT",11,"0.260",{"$nulls":3},4060039021670]
[null,"66F01U349135","FDOOT271-O","F.01U.349.135","Radio fire detector","5A",625.81,{"v":2944,"d":"2,944.00"},"no W-Extension","C","B",8531900000,"CH",93,"0.134",{"$nulls":3},4060039021687]
[null,"66F01U349136","FDB271","F.01U.349.136","Base radio fire detector","5A",11.81,{"v":56,"d":"56.00"},"no W-Extension","C","B",8536909599,"CH",92,"0.039",{"$nulls":3},4060039021694]
[null,"66F01U349137","FDMH273-R","F.01U.349.137","Radio manual call point housing","5A",135.79,{"v":639,"d":"639.00"},"no W-Extension","C","B",8536501999,"CH",5,"0.285",{"$nulls":3},4060039021700]
[null,"66F01U349249","FDME273-O","F.01U.349.249","Radio manual call point switching unit","5A",785.22,{"v":3694,"d":"3,694.00"},"no W-Extension","C","B",8536501999,"CH",6,"0.108",{"$nulls":3},4060039022233]
[null,"66F01U349248","BAT3.6-10","F.01U.349.248","Li-SOCl2 battery pack 3.6V, 10 Ah","5A",80.29,{"v":378,"d":"378.00"},"no W-Extension","C","B",8506501000,"CH",120,"0.09",{"$nulls":3},4060039022226]
[null,"66F01U349251","FDM275-O","F.01U.349.251","Radio manual call point","5A",{"v":811.2,"d":"811.20"},{"v":3816,"d":"3,816.00"},"no W-Extension","C","B",8536501999,"CH",1,"0.224",{"$nulls":3},4060039022257]
[null,"66F01U349250","DMZ1196-AC","F.01U.349.250","Spare glass FDM273-O","5A",10.99,{"$f":"ROUND(ROUND(G199*4.704,2),0)","v":{"v":52,"d":"52.00"}},"no W-Extension","C","B",3926909790,"CH",4,"0.117","Price of 1 Pc.\nBut can be only ordered in set of 10 Pieces ",null,null,4060039022240]
[null,"66F01U349252","FDMG295","F.01U.349.252","Spare glass FDM275-O","5A",13.23,{"v":62,"d":"62.00"},"no W-Extension","C","B",926909790,"CH",1,"0.066","Price of 1 Pc.\nBut can be only ordered in set of 5 Pieces ",null,null,4060039022264]
[null,"66F01U349253","FDMP295","F.01U.349.253","Spare plastic FDM275-O","5A",19.84,{"v":93,"d":"93.00"},"no W-Extension","C","B",3926909790,"CH",0,"0.04","Price of 1 Pc.\nBut can be only ordered in set of 5 Pieces ",null,null,4060039022271]
[null,"66F01U349254","FDUZ227","F.01U.349.254","MCL USB ADAPTER","5A",{"v":1298.86,"d":"1,298.86"},{"v":6110,"d":"6,110.00"},"no W-Extension","C","B",8536909599,"CH",1,"0.197",{"$nulls":3},4060039022288]
[null,"Special detectors",null,"",{"$nulls":4},"",{"$nulls":4},"",""]
[null,"Titanus Smoke extraction systems Systems",{"$nulls":6},"",{"$nulls":4},"",""]
[null,"7050 000 78495","FAS-420-TM","F.01U.078.495","Smoke System","5A",{"v":1736.3,"d":"1,736.30"},{"v":8168,"d":"8,168.00"},"no W-Extension","C","A",8536501999,"DE",11,"0.576",{"$nulls":3},8717332341863]
[null,"7050 000 78496","FAS-420-TM-R","F.01U.078.496","FAS-420-TM-R aspirating smoke detector","5A",{"v":2232.57,"d":"2,232.57"},{"v":10502,"d":"10,502.00"},"no W-Extension","C","A",8536501999,"DE",1,"0.47",{"$nulls":3},8717332341870]
[null,"7050 000 78497","FAS-420-TM-RVB","F.01U.078.497","FAS-420-TM-RVB aspirating smoke detector","5A",{"v":2728.86,"d":"2,728.86"},{"v":12837,"d":"12,837.00"},"no W-Extension","C","A",8536501999,"DE",1,"0.47",{"$nulls":3},8717332341887]
[null,"7050 000 78494 ","FAS-420-TM-HB","F.01U.078.494","FAS-420-TM series housing base","5A",197.99,{"v":931,"d":"931.00"},"no W-Extension","C","A",8536909599,"DE",14,"0.468",{"$nulls":3},8717332341856]
[null,"6650 000 29252","FAS-420-TT1","F.01U.029.252","Titanus Top Sens TT1, LSNi","5A",{"v":4930.48,"d":"4,930.48"},{"v":23193,"d":"23,193.00"},"no W-Extension","C","A",8536501999,"DE",4,"1.341",{"$nulls":3},8717332263530]
[null,"6650 000 29253","FAS-420-TT2","F.01U.029.253","Titanus Top Sens TT2, LSNi","5A",{"v":4930.48,"d":"4,930.48"},{"v":23193,"d":"23,193.00"},"no W-Extension","C","A",8536501999,"DE",6,"1.45",{"$nulls":3},8717332263547]
[null,"6650 000 29255","FAS-420-TP1","F.01U.029.255","Titanus PRO SENS TP-1, LSNi","5A",{"v":2222.08,"d":"2,222.08"},{"v":10453,"d":"10,453.00"},"no W-Extension","C",1,8536501999,"DE",32,"1.53",{"$nulls":3},8717332263554]
[null,"6650 000 29256","FAS-420-TP2","F.01U.029.256","Titanus PRO SENS TP-2, LSNi","5A",{"v":2222.08,"d":"2,222.08"},{"v":10453,"d":"10,453.00"},"no W-Extension","C","A",8536501999,"DE",23,"1.45",{"$nulls":3},8717332263561]
[null,"7050 000 83877","FAS-420-TP1-SL","F.01U.083.877","Titanus Pro Sens Basic TP1 Silent","5A",{"v":2364.15,"d":"2,364.15"},{"v":11121,"d":"11,121.00"},"no W-Extension","C","A",8536501999,"DE",5,"1.45",{"$nulls":3},8717332382514]
[null,"7050 000 83876","FAS-420-TP2-SL","F.01U.083.876","Titanus Pro Sens Basic TP2 Silent","5A",{"v":2364.15,"d":"2,364.15"},{"v":11121,"d":"11,121.00"},"no W-Extension","C","A",8536501999,"DE",7,"1.55",{"$nulls":3},8717332382507]
[null,"7050 000 83875","FAS-420-TT1-SL","F.01U.083.875","Titanus Top Sens Basic TT1 Silent","5A",{"v":5418.61,"d":"5,418.61"},{"v":25489,"d":"25,489.00"},"no W-Extension","C","C",8531900000,"DE",0,"1.45",{"$nulls":3},8717332382491]
[null,"7050 000 83874","FAS-420-TT2-SL","F.01U.083.874","Titanus Top Sens Basic TT2 Silent","5A",{"v":5418.61,"d":"5,418.61"},{"v":25489,"d":"25,489.00"},"no W-Extension","C","A",8536501999,"DE",0,"1.57",{"$nulls":3},8717332382484]
[null,"7050 000 90252","FAS-ASD-SL","F.01U.090.252","Sound Suppressor for Aspirating","5A",247.71,{"v":1165,"d":"1,165.00"},"no W-Extension","C","A",3926909790,"DE",6,"0.43",{"$nulls":3},8717332815821]
[null,"6649 981 43394","DM-TP-50(80)","4.998.143.394","Detector module DM-TP-50(80)-LB/a INCOMPATIBLE WITH FAS-420 TP/TT","5A",616.31,{"v":2899,"d":"2,899.00"},"no W-Extension","C","A",8531900000,"DE",21,"0.11",null,null," INCOMPATIBLE WITH FAS-420 TP/TT",8717332036431]
[null,"6649 981 43395","DM-TP-10(25)","4.998.143.395","Detector module DM-TP-10(25)-LB/a INCOMPATIBLE WITH FAS-420 TP/TT","5A",{"v":1006.22,"d":"1,006.22"},{"v":4733,"d":"4,733.00"},"no W-Extension","C","A",8531900000,"DE",10,"0.116",null,null," INCOMPATIBLE WITH FAS-420 TP/TT",8717332036448]
[null,"6649 981 43396","DM-TP-01(05)","4.998.143.396","Detector module DM-TP-01(05)-LB/a INCOMPATIBLE WITH FAS-420 TP/TT","5A",{"v":2700.02,"d":"2,700.02"},{"v":12701,"d":"12,701.00"},"no W-Extension","C","A",8531900000,"DE",0,"0.1",null,null," INCOMPATIBLE WITH FAS-420 TP/TT",8717332036455]
[null,"6649 981 43400","DM-TT-50(80)","4.998.143.400","Detector module DM-TT-50(80)-LB/a","5A",620.51,{"v":2919,"d":"2,919.00"},"no W-Extension","C","A",8531900000,"DE",46,"0.1",{"$nulls":3},8717332036486]
[null,"6649 981 43401","DM-TT-10(25)",4998143401,"Detector module DM-TT-10(25)-LB/a","5A",{"v":1006.22,"d":"1,006.22"},{"v":4733,"d":"4,733.00"},"no W-Extension","C","A",8531900000,"DE",35,"0.14",{"$nulls":3},8717332036493]
[null,"6649 981 43402","DM-TT-01(05)","4.998.143.402","Detector module DM-TT-01(05)-LB/a","5A",{"v":2704.22,"d":"2,704.22"},{"v":12721,"d":"12,721.00"},"no W-Extension","C","A",8531900000,"DE",18,"0.125",{"$nulls":3},8717332036509]
[null,"Conventional smoke extraction systems ",null,"",{"$nulls":4},"",{"$nulls":4},"",""]
[null,"7050 001 41195","FCS-320-TM","F.01U.141.195","FCS-320-TM Conventional ASD","5A",{"v":1569.58,"d":"1,569.58"},{"v":7383,"d":"7,383.00"},"on demand","C","A",8536501999,"DE",2,"0.53",{"$nulls":3},8717332485130]
[null,"7051 001 41196","FCS-320-TM-R","F.01U.141.196","FCS-320-TM-R Conventional ASD","5A",{"v":2065.86,"d":"2,065.86"},{"v":9718,"d":"9,718.00"},"on demand","C","C",8536501999,"DE",0,"0.47",{"$nulls":3},8717332485147]
[null,"7052 001 41197","FCS-320-TP1","F.01U.141.197","FCS-320-TP1 Conventional ASD","5A",{"v":2054.13,"d":"2,054.13"},{"v":9663,"d":"9,663.00"},"on demand","C","A",8536501999,"DE",6,"1.282",{"$nulls":3},8717332485154]
[null,"7053 001 41198","FCS-320-TP2","F.01U.141.198","FCS-320-TP2 Conventional ASD","5A",{"v":2054.13,"d":"2,054.13"},{"v":9663,"d":"9,663.00"},"on demand","C","A",8536501999,"DE",8,"1.324",{"$nulls":3},8717332485161]
[null,"7050 001 41199","FCA-320-RESET","F.01U.141.199","Reset Board for FCS-320 series","5A",196.69,{"v":925,"d":"925.00"},"no W-Extension","C","A",8531900000,"DE",0,"0.02",{"$nulls":3},8717332485178]
[null,"7050 001 41200","FCA-320-RELAY","F.01U.141.200","Relay Module Type RU-1 for FCS-320-TM-R","5A",369.92,{"v":1740,"d":"1,740.00"},"no W-Extension","C","C",8536490099,"DE",0,"0.1",{"$nulls":3},8717332485185]
[null,"7054 001 41201","FCS-320-IK","F.01U.141.201","Installation Kid for add. modules","5A",{"v":45.6,"d":"45.60"},{"v":215,"d":"215.00"},"no W-Extension","C","C",7326909890,"DE",0,"0.033",{"$nulls":3},8717332485192]
[null,"Titanus Accessories and reduction foils ",null,"",{"$nulls":4},"",{"$nulls":4},"",""]
[null,"6649 981 43410","TITANUS MT-1 mount","4.998.143.410","Fixing unit MT-1","5A",{"v":118.6,"d":"118.60"},{"v":558,"d":"558.00"},"no W-Extension","C","A",7326909890,"DE",2,"0.971",null,"-",null,8717332036516]
[null,"6649 981 43413","TITANUS AF-BR","4.998.143.413","fixing foil","5A",2.12,{"v":10,"d":"10.00"},"no W-Extension","C","A",3926909790,"DE",750,"0.001","Order only 10 pcs or multiple of 10. E.g. needed 30 pcs, order 30 pcs. Price per piece","-",null,8717332036530]
[null,"6649 981 43416","TITANUS AF-2.0","4.998.143.416","reduction foil 2,0mm","5A",2.12,{"v":10,"d":"10.00"},"no W-Extension","C","A",3926909790,"DE",154,"0.017","Order only 10 pcs or multiple of 10. E.g. needed 30 pcs, order 30 pcs. Price per piece","-",null,8717332036547]
[null,"6649 981 43417","TITANUS AF-2.5","4.998.143.417","reduction foil 2,5mm","5A",2.12,{"v":10,"d":"10.00"},"no W-Extension","C","A",3926909790,"DE",150,"0.009","Order only 10 pcs or multiple of 10. E.g. needed 30 pcs, order 30 pcs. Price per piece","-",null,8717332036554]
[null,"6649 981 43418","TITANUS AF-3.0","4.998.143.418","reduction foil 3,0mm","5A",2.12,{"v":10,"d":"10.00"},"no W-Extension","C","A",3926909790,"DE",136,"0.001","Order only 10 pcs or multiple of 10. E.g. needed 30 pcs, order 30 pcs. Price per piece","-",null,8717332036561]
[null,"6649 981 43419","TITANUS AF-3.2","4.998.143.419","reduction foil 3,2mm","5A",2.12,{"v":10,"d":"10.00"},"no W-Extension","C","A",3926909790,"DE",125,"0.012","Order only 10 pcs or multiple of 10. E.g. needed 30 pcs, order 30 pcs. Price per piece","-",null,8717332036578]
[null,"6649 981 43420","TITANUS AF-3.4","4.998.143.420","reduction foil 3,4mm","5A",2.12,{"v":10,"d":"10.00"},"no W-Extension","C","A",3926909790,"DE",122,"0.116","Order only 10 pcs or multiple of 10. E.g. needed 30 pcs, order 30 pcs. Price per piece","-",null,8717332036585]
[null,"6649 981 43422","TITANUS AF-3.6","4.998.143.422","reduction foil 3,6mm","5A",2.12,{"v":10,"d":"10.00"},"no W-Extension","C","A",3926909790,"DE",132,"0.001","Order only 10 pcs or multiple of 10. E.g. needed 30 pcs, order 30 pcs. Price per piece","-",null,8717332036592]
[null,"6649 981 43423","TITANUS AF-3.8","4.998.143.423","reduction foil 3,8mm","5A",2.12,{"v":10,"d":"10.00"},"no W-Extension","C","A",3926909790,"DE",95,"0.366","Order only 10 pcs or multiple of 10. E.g. needed 30 pcs, order 30 pcs. Price per piece","-",null,8717332036608]
[null,"6649 981 43424","TITANUS AF-4.0","4.998.143.424","reduction foil 4,0mm","5A",2.12,{"v":10,"d":"10.00"},"no W-Extension","C","A",3926909790,"DE",126,"0.017","Order only 10 pcs or multiple of 10. E.g. needed 30 pcs, order 30 pcs. Price per piece","-",null,8717332036615]
[null,"6649 981 43425","TITANUS AF-4.2","4.998.143.425","reduction foil 4,2mm","5A",2.12,{"v":10,"d":"10.00"},"no W-Extension","C","A",3926909790,"DE",50,"0.017","Order only 10 pcs or multiple of 10. E.g. needed 30 pcs, order 30 pcs. Price per piece","-",null,8717332036622]
[null,"6649 981 43426","TITANUS AF-4.4","4.998.143.426","reduction foil 4,4mm","5A",2.12,{"v":10,"d":"10.00"},"no W-Extension","C","A",3926909790,"DE",52,"0.017","Order only 10 pcs or multiple of 10. E.g. needed 30 pcs, order 30 pcs. Price per piece","-",null,8717332036639]
[null,"6649 981 43427","TITANUS AF-4.6","4.998.143.427","reduction foil 4,6mm","5A",2.12,{"v":10,"d":"10.00"},"no W-Extension","C","A",3926909790,"DE",37,"0.017","Order only 10 pcs or multiple of 10. E.g. needed 30 pcs, order 30 pcs. Price per piece","-",null,8717332036646]
[null,"6649 981 43428","TITANUS AF-5.0","4.998.143.428","reduction foil 5,0mm","5A",2.12,{"v":10,"d":"10.00"},"no W-Extension","C","A",3926909790,"DE",53,"0.042","Order only 10 pcs or multiple of 10. E.g. needed 30 pcs, order 30 pcs. Price per piece","-",null,8717332036653]
[null,"6649 981 43429","TITANUS AF-5.2","4.998.143.429","reduction foil 5,2mm","5A",2.12,{"v":10,"d":"10.00"},"no W-Extension","C","A",3926909790,"DE",30,"0.008","Order only 10 pcs or multiple of 10. E.g. needed 30 pcs, order 30 pcs. Price per piece","-",null,8717332036660]
[null,"6649 981 43430","TITANUS AF-5.6","4.998.143.430","reduction foil 5,6mm","5A",2.12,{"v":10,"d":"10.00"},"no W-Extension","C","A",3926909790,"DE",45,"0.003","Order only 10 pcs or multiple of 10. E.g. needed 30 pcs, order 30 pcs. Price per piece","-",null,8717332036677]
[null,"6649 981 43431","TITANUS AF-6.0","4.998.143.431","reduction foil 6,0mm","5A",2.12,{"v":10,"d":"10.00"},"no W-Extension","C","A",3926909790,"DE",53,"0.017","Order only 10 pcs or multiple of 10. E.g. needed 30 pcs, order 30 pcs. Price per piece","-",null,8717332036684]
[null,"6649 981 43432","TITANUS AF-6.8","4.998.143.432","reduction foil 6,8mm","5A",2.12,{"v":10,"d":"10.00"},"no W-Extension","C","A",3926909790,"DE",35,"0.017","Order only 10 pcs or multiple of 10. E.g. needed 30 pcs, order 30 pcs. Price per piece","-",null,8717332036691]
[null,"6649 981 43433","TITANUS AF-7.0","4.998.143.433","reduction foil 7,0mm","5A",2.12,{"v":10,"d":"10.00"},"no W-Extension","C","A",3926909790,"DE",51,"0.017","Order only 10 pcs or multiple of 10. E.g. needed 30 pcs, order 30 pcs. Price per piece","-",null,8717332036707]
[null,"6649 981 48848","RAS test-pipe","4.998.148.848","Test tube","5A",70.29,{"v":331,"d":"331.00"},"no W-Extension","C","A",8531900000,"DE",4,"0.12",null,"-",null,8717332036714]
[null,"6649 981 48849","RAS test adapter","4.998.148.849","Test adapter","5A",43.93,{"v":207,"d":"207.00"},"no W-Extension","C","A",3917400099,"DE",8,"0.116",null,"-",null,8717332036721]
[null,"6650 000 33505","FAS-ASD-DIAG","F.01U.033.505","Diagnostic cable incl. software DIAG 3","5A",944.29,{"v":4442,"d":"4,442.00"},"no W-Extension","C","A",8523491000,"DE",2,"0.6",{"$nulls":3},8717332289066]
[null,"Accessories for Titanus ",null,"",{"$nulls":4},"",{"$nulls":4},"",""]
[null,"6650 000 29727","FAS-ASD-AHC","F.01U.029.727","Aspiration hose for ceiling let through","5A",661.82,{"v":3113,"d":"3,113.00"},"no W-Extension","C","A",3917320099,"DE",3,"1.98",{"$nulls":3},8717332264858]
[null,"6650 000 29725","FAS-ASD-CLT","F.01U.029.725","Ceiling let through","5A",22.51,{"v":106,"d":"106.00"},"no W-Extension","C","A",3917400099,"DE",42,"0.009","Delivered in packages of 10 pcs. If 30 pcs needed, order 30 pcs. BLP is per piece.",null,null,8717332264834]
[null,"6650 000 29724","FAS-ASD-AR","F.01U.029.724","Aspiration Reduction","5A",8.19,{"v":39,"d":"39.00"},"no W-Extension","C","A",3926909790,"DE",0,"0.01",{"$nulls":3},8717332264827]
[null,"6650 000 29722","FAS-ASD-F","F.01U.029.722","Flange","5A",{"v":58,"d":"58.00"},{"v":273,"d":"273.00"},"no W-Extension","C","A",3926909790,"DE",9,"0.333",{"$nulls":3},8717332264803]
[null,"6650 000 29721","FAS-ASD-TRPG16","F.01U.029.721","Threaded ring, PG 16","5A",9.56,{"v":45,"d":"45.00"},"no W-Extension","C","A",3917400099,"DE",60,"0.09",{"$nulls":3},8717332264797]
[null,"6650 000 29720","FAS-ASD-CSL","F.01U.029.720","Connection straight line","5A",8.19,{"v":39,"d":"39.00"},"no W-Extension","C","A",3917400099,"DE",157,"0.017",{"$nulls":3},8717332264780]
[null,"6650 000 29719","FAS-ASD-PHF16","F.01U.029.719","Polywell hose flexible, PG 16","5A",511.72,{"v":2407,"d":"2,407.00"},"no W-Extension","C","A",3917320099,"DE",1,"2.42",{"$nulls":3},8717332264773]
[null,"6650 000 29718","FAS-ASD-3WT","F.01U.029.718","Three way tap","5A",238.81,{"$f":"ROUND(ROUND(G263*4.704,2),0)","v":{"v":1123,"d":"1,123.00"}},"no W-Extension","C","A",8481808190,"DE",29,"0.306",{"$nulls":3},8717332264766]
[null,"6650 000 29717","FAS-ASD-WS","F.01U.029.717","Water Separator","5A",614.06,{"v":2889,"d":"2,889.00"},"no W-Extension","C","A",8421210090,"DE",2,"1.324",{"$nulls":3},8717332264759]
[null,"6650 000 29716","FAS-ASD-DSB","F.01U.029.716","Detonation Safety barrier","5A",{"v":2456.24,"d":"2,456.24"},{"v":11554,"d":"11,554.00"},"no W-Extension","C","A",7326909890,"DE",0,"1.341",{"$nulls":3},8717332264742]
[null,"6650 000 29715","FAS-ASD-RFL","F.01U.029.715","Replacement Filter Large","5A",49.12,{"v":231,"d":"231.00"},"no W-Extension","C","A",84219900,"DE",97,"0.018",{"$nulls":3},8717332264735]
[null,"6650 000 29714","FAS-ASD-FL","F.01U.029.714","Filterbox Large","5A",245.63,{"v":1155,"d":"1,155.00"},"no W-Extension","C","A",8421999099,"DE",56,"0.43",{"$nulls":3},8717332264728]
[null,"Fireray Linear Smoke Detectors",null,"",{"$nulls":4},"",{"$nulls":4},"",""]
[null,"7050 002 90195","FIRERAY3000","F.01U.290.195","Fireray 3000 End-To-End Linear Beam","5A",{"v":3051.35,"d":"3,051.35"},{"v":14354,"d":"14,354.00"},"no W-Extension","C","A",8536501999,"GB",7,"1.62",null,null,"Successor of Fireray 2000",8717332929009]
[null,"7050 004 00533","FRAY-ONE-EN","F.01U.400.533","Linear Beam, standalone reflective","5A",{"v":1475.14,"d":"1,475.14"},{"v":6939,"d":"6,939.00"},"no W-Extension","C","A","85365019","GB",15,"0.800",null,null,"Successor of FR50/100",4060039150370]
[null,"7050 002 90196","FIRERAY3000-HD","F.01U.290.196","Fireray 3000 additional Head","5A",{"v":2636.26,"d":"2,636.26"},{"v":12401,"d":"12,401.00"},"no W-Extension","C","A",8536501999,"GB",2,"0.65",{"$nulls":3},8717332929016]
[null,"7050 002 90197","FIRERAY5000-EN","F.01U.290.197","Fireray 5000 Refl. linear beam detector","5A",{"v":2450.98,"d":"2,450.98"},{"v":11529,"d":"11,529.00"},"no W-Extension","C","A",8536501999,"GB",10,"2.106",null,null,"Successor of FRAY 5000 Types",8717332929023]
[null,"7050 001 43257","FRAY5000-HEAD-EN","F.01U.143.247","Additional head for FRAY5000-EN","5A",{"v":1420,"d":"1,420.00"},{"v":6680,"d":"6,680.00"},"no W-Extension","C","A",8531900000,"GB",7,"0.666",{"$nulls":3},8717332493821]
[null,705000083264,"FRAY5000-LR-KIT","F.01U.083.264","Fireray5000 long range kit 50m extension","5A",396.87,{"v":1867,"d":"1,867.00"},"no W-Extension","C","A",8536501999,"GB",18,"0.18",{"$nulls":3},8717332359769]
[null,"7050 000 98240","FRAY5000-BR","F.01U.098.240","Universal Bracket Accessory for Fray5000","5A",397.77,{"v":1871,"d":"1,871.00"},"no W-Extension","C","A",7326909890,"US",14,"0.199",{"$nulls":3},8717332390779]
[null,"7050 000 98241","FRAY5000-4PRISM","F.01U.098.241","Prism Plate for  4 prism","5A",251.78,{"v":1184,"d":"1,184.00"},"no W-Extension","C","A",7326909890,"US",7,"0.383",{"$nulls":3},8717332390786]
[null,"7050 000 98242","FRAY5000-1PRISM","F.01U.098.242","Prism Plate for 1 Prism","5A",220.31,{"v":1036,"d":"1,036.00"},"no W-Extension","C","A",7326909890,"US",6,"0.09",{"$nulls":3},8717332390793]
[null,"Heat detectors",null,"",{"$nulls":4},"",{"$nulls":4},"",""]
[null,"7050 003 32846","FCS-LHD-2EN","F.01U.393.476","Linear heat detector, VdS","5A",{"v":3240.92,"d":"3,240.92"},{"v":15245,"d":"15,245.00"},"no W-Extension","C","A",8536501990,"GB",null,"0.950",{"$nulls":3},4060039128997]
["2025-06-20","7050 003 95474","FCS-LHDSC-EN100","F.01U.395.474","Sensor cable PVC, VdS, 100m","5A",{"v":1536.39,"d":"1,536.39"},{"v":7227,"d":"7,227.00"},"no W-Extension","C","A",85444993,"GB",1,"2.470","Sensor cable on reel 100m",null,null,4060039133205]
["2025-06-20","7051 003 95475","FCS-LHDSC-EN250","F.01U.395.475","Sensor cable PVC, VdS, 250m","5A",{"v":3843.63,"d":"3,843.63"},{"v":18080,"d":"18,080.00"},"no W-Extension","C","A",85444993,"GB",1,"6.180","Sensor cable on reel 250m",null,null,4060039133212]
["2025-06-20","7052 003 95476","FCS-LHDSC-EN500","F.01U.395.476","Sensor cable PVC, VdS, 500m","5A",{"v":7657.5,"d":"7,657.50"},{"v":36021,"d":"36,021.00"},"no W-Extension","C","A",85444993,"GB",2,"12.350","Sensor cable on reel 500m",null,null,4060039133229]
["2025-06-20","7050 004 03515","FCS-LHDSC-NYL100","F.01U.403.515","Sensor cable nylon, VdS, 100m","5A",{"v":1932.72,"d":"1,932.72"},{"v":9092,"d":"9,092.00"},"no W-Extension","C","A",85444993,"GB",0,"3.510","Sensor cable on reel 100m",null,null,4060039154903]
["2025-06-20","7051 004 03516","FCS-LHDSC-NYL250","F.01U.403.516","Sensor cable nylon, VdS, 250m","5A",{"v":4770.64,"d":"4,770.64"},{"v":22441,"d":"22,441.00"},"no W-Extension","C","A",85444993,"GB",0,"8.780","Sensor cable on reel 250m",null,null,4060039154910]
["2025-06-20","7052 004 03517","FCS-LHDSC-NYL500","F.01U.403.517","Sensor cable nylon, VdS, 500m","5A",{"v":9296.64,"d":"9,296.64"},{"v":43731,"d":"43,731.00"},"no W-Extension","C","A",85444993,"GB",0,"17.550","Sensor cable on reel 500m",null,null,4060039154927]
["2025-06-20","7053 004 03518","FCS-LHDSC-STL100","F.01U.403.518","Sensor cable steel, VdS, 100m","5A",{"v":3094.8,"d":"3,094.80"},{"v":14558,"d":"14,558.00"},"no W-Extension","C","A",85444993,"GB",0,"3.770","Sensor cable on reel 100m",null,null,4060039154934]
["2025-06-20","7054 004 03519","FCS-LHDSC-STL250","F.01U.403.519","Sensor cable steel, VdS, 250m","5A",{"v":7568.82,"d":"7,568.82"},{"v":35604,"d":"35,604.00"},"no W-Extension","C","A",85444993,"GB",0,"9.430","Sensor cable on reel 250m",null,null,4060039154941]
["2025-06-20","7055 004 03520","FCS-LHDSC-STL500","F.01U.403.520","Sensor cable steel, VdS, 500m","5A",{"v":14801.25,"d":"14,801.25"},{"v":69625,"d":"69,625.00"},"no W-Extension","C","A",85444993,"GB",0,"18.850","Sensor cable on reel 500m",null,null,4060039154958]
["2025-06-20","7050 003 95477","FCS-LHD2EN-EOL","F.01U.395.477","End-of-line module, VdS","5A",409.05,{"v":1924,"d":"1,924.00"},"no W-Extension","C","A",85319000,"GB",0,"0.112",{"$nulls":3},4060039133236]
["2025-06-20","7051 003 95478","FCS-LHD2EN-CONN","F.01U.395.478","Connection module, VdS","5A",314.65,{"v":1480,"d":"1,480.00"},"no W-Extension","C","A",85319000,"GB",1,"0.211",{"$nulls":3},4060039133243]
["2025-06-20","7050 003 98503","FCS-LHD2EN-FIX","F.01U.398.503","Fixing base, 20mm","5A",255.21,{"v":1201,"d":"1,201.00"},"no W-Extension","C","A",85319000,"GB",0,"0.240",{"$nulls":3},4060039147196]
["2025-06-20","7050 003 95480","FCS-LHD2EN-CLIP","F.01U.395.480","L-Clip, 50mm","5A",300.19,{"v":1412,"d":"1,412.00"},"no W-Extension","C","A",73261990,"GB",0,"0.040","One unit contains 100 pcs. When 200 clips needed, order 2 units",null,null,4060039133267]
["2025-06-20","7050 003 95479","FCS-LHD2EN-SLE","F.01U.395.479","Silicone sleeves","5A",78.66,{"v":370,"d":"370.00"},"no W-Extension","C","A",39259010,"GB",0,"1.590",{"$nulls":3},4060039133250]
[null,"Duct detector",null,"",{"$nulls":4},"",{"$nulls":4},"",""]
[null,"7850 000 29411","FAD-420-HS-EN","F.01U.029.411","Air sampling housing with MS400 base","5A",214.66,{"v":1010,"d":"1,010.00"},"no W-Extension","C","A",8536909599,"CN",125,"1.944",{"$nulls":3},8717332264193]
[null,"7050 003 08231","FAD-425-O-R","F.01U.308.231","Detector for use in air sampling housing","5A",{"v":107.4,"d":"107.40"},{"v":505,"d":"505.00"},"on demand","C","A",8531103000,"PT",136,"0.077",null,"SBN",null,8717332974498]
[null,"6650 000 29219","D344-1.5","F.01U.029.219","DUCT SAMPLE TUBE 1.5 FEET","5A",22.14,{"v":104,"d":"104.00"},"no W-Extension","C","A",7608208990,"CN",11,"0.058",{"$nulls":3},8717332288274]
[null,"6650 000 29175","D344-3","F.01U.029.175","DUCT SAMPLE TUBE 3 FOOT","5A",42.98,{"v":202,"d":"202.00"},"no W-Extension","C","A",7608208990,"CN",31,"0.116",{"$nulls":3},8717332288458]
[null,"6650 000 29174","D344-5","F.01U.029.174","SAMPLE TUBE 5FT (DS290)","5A",71.64,{"v":337,"d":"337.00"},"no W-Extension","C","A",7608208990,"CN",31,"0.21",{"$nulls":3},8717332288465]
[null,"1826 950 89828","D344-TF","F.01U.425.789","DUCT TUBE FILTERS 20/PK","5A",{"v":132.6,"d":"132.60"},{"v":624,"d":"624.00"},"no W-Extension","C","A",8421999099,"CN",2,"0.14",{"$nulls":3},782695089828]
[null,"7850 000 29619","FAD-RB-DIBT","F.01U.029.619","Relay board for DIBT application","5A",46.96,{"v":221,"d":"221.00"},"no W-Extension","C","A",85371099,"CN",4,"0.018",{"$nulls":3},800549091183]
[null,"Infrared flame detector",null,"",{"$nulls":4},"",{"$nulls":4},"",""]
[null,null,"922819","F.01U.418.818","IR flame detector FMX5000 IR VK","5A",{"v":6215.63,"d":"6,215.63"},{"v":29238,"d":"29,238.00"},"no W-Extension","C","C",85365019,"DE",null,"0.590","For operation of the detector order also:  929144, 924441, optional: 904757",null,null,4060039188960]
[null,null,924420,"F.01U.418.819","IR-flame detector FMX5000 IR 3GD","5A",{"v":7703.12,"d":"7,703.12"},{"v":36235,"d":"36,235.00"},"no W-extension","C","C","90318080","DE",2,"0.590","For operation of the detector order also 926826, 924442, optional:  904757",null,null,4060039188977]
[null,null,926826,"F.01U.418.822","Relay module KMX5000 RK 3GD VK","5A",{"v":637.5,"d":"637.50"},{"v":2999,"d":"2,999.00"},"no W-extension","C","C","85319085","DE",2,"0.050",{"$nulls":3},4060039189004]
[null,null,929144,"F.01U.418.821","Relay module KMX5000 RK VK","5A",474.85,{"v":2234,"d":"2,234.00"},"no W-Extension","C","C",85319000,"DE",null,"0.050",{"$nulls":3},4060039188991]
[null,null,924441,"F.01U.418.824","Socket MX5000 VK","5A",{"v":321.4,"d":"321.40"},{"v":1512,"d":"1,512.00"},"no W-Extension","C","C",85389099,"DE",null,"0.380",{"$nulls":3},4060039189028]
[null,null,904757,"F.01U.418.826","Bracket MX5000","5A",50.35,{"v":237,"d":"237.00"},"no W-Extension","C","C",85389099,"DE",null,"0.095",{"$nulls":3},4060039189042]
[null,null,911674,"F.01U.418.820","IR-flame detector FMX5000 IR Ex","5A",{"v":9031.25,"d":"9,031.25"},{"v":42483,"d":"42,483.00"},"no W-Extension","C","C","90318080","DE",null,"0.590","Order together with: 922689 and 924442. Order optional 904757",null,null,4060039188984]
[null,null,922689,"F.01U.418.823","Safety barrier Ex isol. 24V 2 channel","5A",{"v":1992.19,"d":"1,992.19"},{"v":9371,"d":"9,371.00"},"no W-Extension","C","C","85363010","DE",null,"0.150",{"$nulls":3},4060039189011]
[null,null,924442,"F.01U.418.825","Socket MX5000 Ex VK","5A",584.38,{"v":2749,"d":"2,749.00"},"no W-Extension","C","C","85389099","DE",null,"0.530",{"$nulls":3},4060039189035]
[null,"7050 002 79762","016589","F.01U.279.762","IR3 Flame Detector","5A",{"v":6906.25,"d":"6,906.25"},{"v":32487,"d":"32,487.00"},"no W-Extension","C","A",8536501999,"GB",6,"2.0",null,"SBN",null,8717332906345]
[null,"7050 002 79880","007127","F.01U.279.880","Mounting Bracket Flame Detector","5A",409.12,{"v":1925,"d":"1,925.00"},"no W-Extension","C","A",8536501999,"GB",9,"0.655",null,"SBN",null,8717332906376]
[null,"Addressable manual call points",null,"",{"$nulls":4},"",{"$nulls":4},"",""]
[null,"6650 000 11956","FMC-210-DM-G-R","F.01U.011.956","FMC-210-DM-G-R MCP LSN indoor red","5A",60.81,{"v":286,"d":"286.00"},"no W-Extension","C",1,8536501999,"CN",992,"0.237",null,"SBN",null,8717332250127]
[null,"6650 000 11958","FMC-210-DM-H-R","F.01U.011.958","FMC-210-DM-H-R MCP LSN outdoor red","5A",{"v":152,"d":"152.00"},{"v":715,"d":"715.00"},"no W-Extension","C",1,8536501999,"CN",62,"0.244",null,"SBN",null,8717332250134]
[null,"6650 000 11959","FMC-210-DM-G-B","F.01U.011.959","FMC-210-DM-G-B MCP LSN Indoor blue","5A",60.81,{"v":286,"d":"286.00"},"no W-Extension","C",1,8536501999,"CN",222,"0.252",null,"SBN",null,8717332250141]
[null,"6650 000 11960","FMC-210-DM-H-B","F.01U.011.960","FMC-210-DM-H-B MCP LSN outdoor blue","5A",{"v":152,"d":"152.00"},{"v":715,"d":"715.00"},"no W-Extension","C","A",8531900000,"CN",7,"0.249",null,"SBN",null,8717332250158]
[null,"6650 000 11961","FMC-210-DM-G-Y","F.01U.011.961","FMC-210-DM-G-Y MCP LSN indoor yellow","5A",60.81,{"v":286,"d":"286.00"},"no W-Extension","C","A",8531900000,"CN",28,"0.241",null,"SBN",null,8717332250165]
[null,"6650 000 11962","FMC-210-SM-G-R","F.01U.011.962","FMC-210-SM-G-R single action indoor red","5A",63.38,{"v":298,"d":"298.00"},"no W-Extension","C","A",8536501999,"CN",20,"0.236",{"$nulls":3},8717332250172]
[null,"7850 000 27317","FMC-210-SM-G-B","F.01U.027.317","FMC-210-SM-G-B single action indoor blue","5A",63.38,{"v":298,"d":"298.00"},"no W-Extension","C","A",8536501999,"CN",4,"0.249",{"$nulls":3},8717332256686]
[null,"7050 003 28502 ","FMC-210-DM-G-GR","F.01U.328.502","FMC-210-DM-G-GR MCP LSN Indoor green","5A",60.81,{"v":286,"d":"286.00"},"on demand","C",1,8536501999,"CN",15,"0.249",null,"SBN",null,8717332951499]
[null,"6650 000 12781","FMC-420RW-GSGRD","F.01U.012.781","MCP_LSNi_INDOOR_SURFACE_GLASS_RED","5A",71.31,{"v":335,"d":"335.00"},"on demand","C","A",8536501999,"CN",64,"0.835",{"$nulls":3},8717332259236]
[null,"6650 000 12782","FMC-420RW-GSRRD","F.01U.012.782","MCP_LSNi_INDOOR_SURFMT_RESET_RED","5A",71.31,{"v":335,"d":"335.00"},"on demand","C",1,8536501999,"CN",497,"0.183",{"$nulls":3},8717332259243]
[null,"6650 000 12783","FMC-420RW-GFGRD","F.01U.012.783","MCP_LSNi_INDOOR_FLUSHMOUNT_GLASS_RED","5A",71.31,{"v":335,"d":"335.00"},"on demand","C","A",8536501999,"CN",3,"0.183",{"$nulls":3},8717332259250]
[null,"6650 000 12784","FMC-420RW-GFRRD","F.01U.012.784","MCP_LSNi_INDOOR_FLUSHMOUNT_RESET_RED","5A",71.31,{"v":335,"d":"335.00"},"on demand","C","A",8536501999,"CN",28,"0.17",{"$nulls":3},8717332259267]
[null,"6650 000 12707","FMC-420RW-GSGBU","F.01U.012.707","MCP_LSNi_INDOOR_SURFMT_GLASS_BLUE","5A",71.31,{"$f":"ROUND(ROUND(G327*4.704,2),0)","v":{"v":335,"d":"335.00"}},"on demand","C","C",8536501999,"CN",0,"0.241",{"$nulls":3},"8717332259199"]
[null,"6650 000 12708","FMC-420RW-GSRBU","F.01U.012.708","MCP_LSNi_INDOOR_SURFMT_RESET_BLUE","5A",71.31,{"v":335,"d":"335.00"},"on demand","C","A",8536501999,"CN",12,"0.835",{"$nulls":3},"8717332259205"]
[null,"6650 000 12787","FMC-420RW-GSGYE","F.01U.012.787","MCP_LSNi_INDOOR_SURFMT_GLASS_YEL","5A",71.31,{"v":335,"d":"335.00"},"on demand","C","C",8536501999,"CN",0,"0.249",{"$nulls":3},"8717332259274"]
[null,"6650 000 12788","FMC-420RW-GSRYE","F.01U.012.788","MCP_LSNi_INDOOR_SURFMT_RESET_YEL","5A",71.31,{"v":335,"d":"335.00"},"on demand","C","A",8536501999,"CN",27,"0.249",{"$nulls":3},"8717332259281"]
[null,665000012709,"FMC-420RW-HSGRD","F.01U.012.709","MCP LSNi, Outdoor (H), Surface mounted, Glass, Red","5A",234.78,{"v":1104,"d":"1,104.00"},"on demand","C","A",8536501999,"CN",9,"0.3",{"$nulls":3},8717332259212]
[null,665000012780,"FMC-420RW-HSRRD","F.01U.012.780","MCP LSNi, Outdoor (H), Surface mounted, Resettable, Red","5A",234.78,{"v":1104,"d":"1,104.00"},"on demand","C",1,8536501999,"CN",36,"0.468",{"$nulls":3},8717332259229]
[null,"7050 002 49820","FMC-420IS-GSRRD","F.01U.249.820","Manual call point resettable red, Israel","5A",70.54,{"v":332,"d":"332.00"},"on demand","C","C","85319000","CN",0,0.27,null,null,"Mainly used for Israel",8717332828876]
[null,"Conventional manual call points",null,"",{"$nulls":4},"",{"$nulls":4},"",""]
[null,"6650 000 11951","FMC-120-DKM-G-R","F.01U.011.951","FMC-120-DKM-G-R MCP conv indoor red","5A",40.08,{"v":189,"d":"189.00"},"no W-Extension","C",1,8536501999,"CN",59,"0.243",null,"SBN",null,8717332250073]
[null,"6650 000 11952","FMC-120-DKM-H-R","F.01U.011.952","FMC-120-DKM-H-R MCP conv outdoor red","5A",100.87,{"v":474,"d":"474.00"},"no W-Extension","C","A",8536501999,"CN",23,"0.233",null,"SBN",null,8717332250080]
[null,"6650 000 11953","FMC-120-DKM-G-B","F.01U.011.953","FMC-120-DKM-G-B MCP conv Indoor blue","5A",40.08,{"v":189,"d":"189.00"},"no W-Extension","C","A",8536501999,"CN",69,"0.224",null,"SBN",null,8717332250097]
[null,"6650 000 11954","FMC-120-DKM-H-B","F.01U.011.954","FMC-120-DKM-H-B MCP conv Outdoor blue","5A",100.87,{"v":474,"d":"474.00"},"no W-Extension","C","A",8536501999,"CN",4,"0.237",null,"SBN",null,8717332250103]
[null,"6650 000 12763","FMC-120-EST-G-B","F.01U.012.763","FMC-120-EST-G-B Stop dev. indoor, blue","5A",60.38,{"v":284,"d":"284.00"},"no W-Extension","C","A",8536501999,"CN",17,"0.224",null,"SBN",null,8717332258024]
[null,"6650 000 11955","FMC-120-DKM-G-Y","F.01U.011.955","FMC-120-DKM-G-Y MCP conv Indoor yellow","5A",40.08,{"v":189,"d":"189.00"},"no W-Extension","C","A",8536501999,"CN",135,"0.222",null,"SBN",null,8717332250110]
[null,"6650 000 12771","FMC-300RW-GSGRD","F.01U.012.771","MCP_CONV_820_INDOOR_SURFMT_GLASS_RED","5A",36.88,{"v":173,"d":"173.00"},"on demand","C","A",8536501999,"CN",3,"0.249",{"$nulls":3},8717332259090]
[null,"6650 000 12777","FMC-300RW-GSRRD","F.01U.012.777","MCP_CONV_820_INDOOR_SURFMT_RESET_RED","5A",36.88,{"v":173,"d":"173.00"},"on demand","C","A",8536501999,"CN",146,"0.27",{"$nulls":3},8717332259168]
[null,"6650 000 12724","FMC-300RW-GSGBU","F.01U.012.724","MCP_CONV_820_INDOOR_SURFMT_GLASS_BLUE","5A",36.88,{"v":173,"d":"173.00"},"on demand","C","A",8536501999,"CN",2,"0.241",{"$nulls":3},"8717332259144"]
[null,"6650 000 12770","FMC-300RW-GSRBU","F.01U.012.770","MCP_CONV_820_INDOOR_SURFMT_RESET_BLUE","5A",36.88,{"v":173,"d":"173.00"},"on demand","C","A",8536501999,"CN",8,"0.249",{"$nulls":3},"8717332259083"]
[null,"6650 000 12778","FMC-300RW-GSGYE","F.01U.012.778","MCP_CONV_820_INDOOR_SURFMT_GLASS_YEL","5A",36.88,{"v":173,"d":"173.00"},"on demand","C","A",8536501999,"CN",2,"0.249",{"$nulls":3},"8717332259175"]
[null,"6650 000 12779","FMC-300RW-GSRYE","F.01U.012.779","MCP_CONV_820_INDOOR_SURFMT_RESET_YEL","5A",36.88,{"v":173,"d":"173.00"},"on demand","C","A",8536501999,"CN",23,"0.233",{"$nulls":3},"8717332259182"]
[null,"Conventional manual call points for ex areas",null,"",{"$nulls":4},"",{"$nulls":4},"",""]
["2025-06-20","6649 980 10934","DKM 2014/2-ex-UGM","4.998.010.934","Ex DKM Type K f UGM-GLT conv manual call point","5A",{"v":2200.89,"d":"2,200.89"},{"v":10353,"d":"10,353.00"},"no W-Extension","C","A",8536501999,"DE",1,"1.552",{"$nulls":3},8717332019847]
["2025-06-20","6649 980 10933","DKM 2014/2-ex","4.998.010.933","double action button, form K, red","5A",{"v":2200.89,"d":"2,200.89"},{"v":10353,"d":"10,353.00"},"no W-Extension","C","A",8536501999,"DE","","1.527",{"$nulls":3},8717332019830]
[null,"6649 981 12084","DM1103B-Ex","4.998.112.084","DM 1103B-EXP, manual call point, double action, red, connect to ex-barrier SB3","5A",400.86,{"v":1886,"d":"1,886.00"},"no W-Extension","C","A",8536501999,"CN",5,"0.333",{"$nulls":3},8717332003648]
[null,"Accessories - manual call points LSN and conventional",null,"",{"$nulls":4},"",{"$nulls":4},"",""]
[null,"6650 000 12951","FMC-FST-DE","F.01U.012.951","FMC-FST-DE Foil set transp","5A",161.16,{"v":758,"d":"758.00"},"no W-Extension","C","A",3919908099,"DE",9,"0.07",null,"-",null,"8717332250202"]
[null,"7750 000 25845","FMC-SPGL-DEIL","F.01U.025.845","Spare glass pane for MCP, 5 glasses","5A",33.16,{"v":156,"d":"156.00"},"no W-Extension","C","A",70060090,"DE",131,"0.075",{"$nulls":3},8717332252374]
[null,"6649 981 03969","SM210-SPARE-GLASS","4.998.103.969","spare glass, SM 210 LSN RW / SM 120 RW (10 pc)","5A",24.59,{"v":116,"d":"116.00"},"no W-Extension","C","A",70060090,"GB",12,"0.116",null,"-",null,8717332003518]
[null,"6649 980 01364","FMM-plate-blue","4.998.001.364","Insert plate DKM120 blue for test call points","5A",19.42,{"v":91,"d":"91.00"},"no W-Extension","C","A",7610909000,"DE",12,"0.017",null,"-",null,8717332019700]
[null,"6637 566 30007","FMM-KEY-Form G/H","3.756.630.007","Key for Manual Callpoint","5A",1.75,{"v":8,"d":"8.00"},"no W-Extension","C","A",85319010,"CN",401,"0.017",null,"-",null,8717332022724]
[null,"7733 022 00737","FMM-SEAL-RED","3.302.200.737","seal red","5A",{"v":15.3,"d":"15.30"},{"v":72,"d":"72.00"},"no W-Extension","C","A",3926909790,"DE",103,"0.012",null,"-",null,871733209655]
[null,"6649 981 03190","DKM120-LABEL","4.998.103.190","stickers without text for own lettering, 10 foils with 6 pc each (for laser printer)","5A",13.41,{"v":63,"d":"63.00"},"no W-Extension","C","A",3919101990,"DE",22,"0.15","Delivered in packages of 10 pcs. If 30 pcs needed, order 3 pcs.","-",null,8717332003501]
[null,"7050 000 73045","FMC-BEZEL-RD","F.01U.073.045","FMC-BEZEL-RD Bezel for MCP RW, red ","5A",29.45,{"v":139,"d":"139.00"},"no W-Extension","C","A",3926909790,"CN",8,"0.175","Delivered in packages of 4 pcs. If 12 pcs needed, order 3 pcs.",null,null,8717332324859]
[null,"7050 000 73046","FMC-BEZEL-WH","F.01U.073.046","FMC-BEZEL-WH Bezel for MCP RW, white","5A",29.45,{"v":139,"d":"139.00"},"no W-Extension","C","C",3926909790,"CN",0,"0.183","Delivered in packages of 4 pcs. If 12 pcs needed, order 3 pcs.",null,null,8717332324866]
[null,"6650 000 13460","FMC-Spacer-RWRD","F.01U.013.460","FMC-SPACER-RWRD Spacer for MCP RW, red","5A",12.68,{"v":60,"d":"60.00"},"no W-Extension","C","C",3926909790,"CN",0,"0.03",{"$nulls":3},"8717332259304"]
[null,"6650 000 13504","FMC-SPGL-RW","F.01U.013.504","FMC-SPGL-RW Spare glass for MCP RW","5A",48.96,{"v":230,"d":"230.00"},"no W-Extension","C","A",70060090,"CN",16,"0.07","Delivered in packages of 5 pcs. If 15 pcs needed, order 3 pcs.",null,null,"8717332259045"]
[null,"6650 000 28195","FMC-SIGN-RW","F.01U.028.195","FMC-SIGN-RW Out of order sign for MCP RW","5A",12.68,{"v":60,"d":"60.00"},"no W-Extension","C","C",3926909790,"CN",0,"0.05",{"$nulls":3},"8717332259601"]
[null,"6650 000 28227","FMC-KEY-RW","F.01U.028.227","FMC-KEY-RW Test key for MCP RW","5A",1.21,{"v":6,"d":"6.00"},"no W-Extension","C","A",3926909790,"CN",440,"0.001",{"$nulls":3},"8717332259724"]
[null,"6650 000 28194","FMC-FLAP-RW","F.01U.028.194","FMC-FLAP-RW clear hinged flap for MCP RW (1 unit= 5 pieces)","5A",17.89,{"v":84,"d":"84.00"},"no W-Extension","C","A",3926909790,"CN",124,"0.099","Delivered in packages of 5 pcs. If 15 pcs needed, order 3 pcs.",null,null,"8717332259595"]
[null,"7050 000 73214","FMC-SEAL-RW","F.01U.073.214","FMC-SEAL-RW Seal for MCP RW","5A",26.84,{"v":126,"d":"126.00"},"no W-Extension","C","C",8309909090,"CN",0,"0.008","Delivered in packages of 100 pcs.if 200 pcs needed, order 2 pcs. (packages). REUP per 100 pcs",null,null,8717332325252]
[null,"LSN interface modules",null,"",{"$nulls":4},"",{"$nulls":4},"",""]
[null,"Series 430",null,"",{"$nulls":4},"",{"$nulls":4},"",""]
["2025-02-10","7050 004 02681","FLM-430-I2M1","F.01U.402.681","Interface module 2 inputs 1 output","5A",218.75,{"v":1029,"d":"1,029.00"},"no W-Extension","C","A",85371098,"PT",null,"0.135",null,"SBN",null,4060039153524]
["2025-02-10","7051 004 02681","FLM-430-SMB","F.01U.402.682","Surface mount box","5A",46.88,{"v":221,"d":"221.00"},"no W-Extension","C","A",39269097,"PT",null,"0.317",null,"SBN",null,4060039153531]
["2025-02-10","7052 004 02681","FLM-430-CLIP","F.01U.402.683","DIN clip for interface module","5A",18.75,{"v":88,"d":"88.00"},"no W-Extension","C","A",39269097,"PT",null,"0.021","One unit contains 5 clips and 11 screws","SBN",null,4060039153548]
["2025-02-10","7053 004 02681","FLM-430-CABLE","F.01U.402.684","Cable kit for interface module","5A",31.25,{"v":147,"d":"147.00"},"no W-Extension","C","A",85444290,"PT",null,"0.034","One unit contains 5 cables","SBN",null,4060039153555]
[null,"Series 420",null,"",{"$nulls":4},"",{"$nulls":4},"",""]
[null,"6650 000 33255","FLM-420-O8I2-S","F.01U.033.255","Interface 8 OC outputs + 2 inputs, surface mount","5A",222.77,{"v":1048,"d":"1,048.00"},"on demand","C","A",8517620000,"CN",20,"0.563",{"$nulls":3},8717332288403]
[null,"6650 000 33257","FLM-420-O1I1-E","F.01U.033.257","Interface 1 OC output + 1 input, integration mount","5A",105.89,{"v":498,"d":"498.00"},"on demand","C","A",8517620000,"CN",532,"0.133",{"$nulls":3},8717332288427]
[null,"6650 000 33256","FLM-420-O1I1-D","F.01U.033.256","Interface 1 OC output + 1 input, DIN rail","5A",{"v":130.8,"d":"130.80"},{"v":615,"d":"615.00"},"on demand","C","A",8517620000,"CN",122,"0.316",{"$nulls":3},8717332288410]
[null,"7050 000 80970","FLM-420-RLE-S","F.01U.080.970","Interface for extinguishing panels, surface mount & DIN rail","5A",189.76,{"v":893,"d":"893.00"},"on demand","C","A",8536501999,"CN",169,"0.45",{"$nulls":3},8717332349562]
[null,"6650 000 33247","FLM-420-RLV8-S","F.01U.033.247","Interface 8 relay outputs, surface mount","5A",{"v":279.7,"d":"279.70"},{"v":1316,"d":"1,316.00"},"on demand","C",1,8517620000,"CN",355,"0.648",{"$nulls":3},8717332288359]
[null,"6650 000 33251","FLM-420-I8R1-S","F.01U.033.251","Interface 8 inputs, 1 relay output, surface mount","5A",222.77,{"v":1048,"d":"1,048.00"},"on demand","C",1,8517620000,"CN",498,"0.666",{"$nulls":3},8717332288373]
[null,"6650 005 08710","FLM-420-RHV-S","F.01U.508.710","Interface 2 high voltage relay outputs + 2 inputs, surface mount","5A",199.07,{"v":936,"d":"936.00"},"on demand","C",1,8517620000,"CN",295,"0.5",null,"SBN",null,8717332099238]
[null,"6650 005 08714","FLM-420-RHV-D","F.01U.508.714","Interface 2 high voltage relay outputs + 2 inputs, DIN rail","5A",180.96,{"v":851,"d":"851.00"},"on demand","C","A",8517620000,"CN",108,"0.324",null,"SBN",null,8717332099252]
[null,"6650 000 12534","FLM-420/4-CON-S","F.01U.012.534","Interface two conventional zones, surface mount","5A",180.96,{"v":851,"d":"851.00"},"on demand","C",1,8517620000,"CN",187,"0.504",{"$nulls":3},8717332250257]
[null,"6650 000 12535","FLM-420/4-CON-D","F.01U.012.535","Interface two conventional zones, DIN rail","5A",173.73,{"v":817,"d":"817.00"},"on demand","C","A",8517620000,"CN",64,"0.115",{"$nulls":3},8717332250264]
[null,"7850 005 08711","FLM-I 420-S","F.01U.508.711","Stand alone short cicuit isolator, surface mount","5A",85.74,{"v":403,"d":"403.00"},"no W-Extension","C","A",8517620000,"CN",16,"0.466",null,"SBN",null,8717332256020]
[null,"6650 000 12542","FLM-420-I2-W","F.01U.012.542","Interface 2 inputs, wall mount","5A",109.04,{"v":513,"d":"513.00"},"on demand","C","A",8517620000,"CN",34,"0.116",null,"SBN",null,8717332250295]
[null,"6650 000 12571","FLM-420-I2-E","F.01U.012.571","Interface 2 inputs, integration mount","5A",105.89,{"v":498,"d":"498.00"},"on demand","C","A",8517620000,"CN",243,"0.099",null,"SBN",null,8717332250301]
[null,"6650 000 12578","FLM-420-I2-D","F.01U.012.578","Interface 2 inputs, DIN rail","5A",{"v":130.8,"d":"130.80"},{"v":615,"d":"615.00"},"on demand","C","A",8517620000,"CN",157,"0.306",null,"SBN",null,8717332250318]
[null,"6650 000 12591","FLM-420-RLV1-E","F.01U.012.591","Interface 1 relay output, integration mount","5A",105.89,{"v":498,"d":"498.00"},"on demand","C","A",8517620000,"CN",582,"0.106",null,"SBN",null,8717332250400]
[null,"6650 000 12594","FLM-420-RLV1-D","F.01U.012.594","Interface 1 relay output, DIN rail","5A",{"v":130.8,"d":"130.80"},{"v":615,"d":"615.00"},"on demand","C","A",8517620000,"CN",203,"0.302",null,"SBN",null,8717332250417]
[null,"6650 000 12595","FMX-IFB55-S","F.01U.012.595","Round surface mount box for wall mount","5A",7.24,{"v":34,"d":"34.00"},"no W-Extension","C","A",3926909790,"CN",39,"0.029",null,"-",null,8717332250424]
[null,"6650 000 29614","FLM-IFB126-S","F.01U.029.614","Square surface mount box for DIN rail modules","5A",21.73,{"$f":"ROUND(ROUND(G391*4.704,2),0)","v":{"v":102,"d":"102.00"}},"no W-Extension","C",1,3926909790,"CN",375,"0.349",null,"-",null,8717332264636]
[null,"7050 000 96884","FLM-420-EOL2W-W","F.01U.096.884","End of line module 2 wire LSN stub, wall mount","5A",84.32,{"v":397,"d":"397.00"},"no W-Extension","C","A",8537109199,"CN",2,"0.12",{"$nulls":3},8717332381395]
[null,"7050 000 83617 ","FLM-420-EOL4W-S","F.01U.083.617","End of line module 4 wire LSN stub, surface mount","5A",168.67,{"v":793,"d":"793.00"},"on demand","C","A",8536501999,"CN",4,"0.48",null,"SBN",null,8717332361090]
[null,"7050 000 83618","FLM-420-EOL4W-D","F.01U.083.618","End of line module 4 wire LSN stub, DIN rail","5A",{"v":154.6,"d":"154.60"},{"v":727,"d":"727.00"},"on demand","C","A",8536501999,"CN",0,"0.28",null,"SBN",null,8717332361106]
[null,"Signalling Devices",null,"",{"$nulls":4},"",{"$nulls":4},"",""]
[null,"Addressabl Sounder-Strobe Combination",null,"",{"$nulls":4},"",{"$nulls":4},"",""]
[null,"7050 003 59432","FNX-425U-WFWH","F.01U.359.432","Acoustic/visual alarm wh, wh","5A",381.59,{"v":1795,"d":"1,795.00"},"no W-Extension","C","A","8531103000","DE",42,"0.473","Battery included, White cover not included in delivery",null,null,"4060039071873"]
[null,"7050 003 59433","FNX-425U-RFWH","F.01U.359.433","Acoustic/visual alarm rd, wh","5A",381.59,{"v":1795,"d":"1,795.00"},"no W-Extension","C","A","8531103000","DE",60,"0.473","Battery included, White cover not included in delivery",null,null,"4060039071880"]
[null,"7050 003 59434","FNX-425U-WFRD","F.01U.359.434","Acoustic/visual alarm wh, rd","5A",381.59,{"v":1795,"d":"1,795.00"},"no W-Extension","C","A","8531103000","DE",39,"0.473","Battery included. Red cover is included in delivery",null,null,"4060039071897"]
[null,"7050 003 59435","FNX-425U-RFRD","F.01U.359.435","Acoustic/visual alarm rd, rd","5A",381.59,{"v":1795,"d":"1,795.00"},"no W-Extension","C","A","8531103000","DE",37,"0.473","Battery included. Red cover is included in delivery",null,null,"4060039071903"]
[null,"7050 003 59438","FNX-425U-BAT","F.01U.359.438","Battery for AVENAR all-in-one 4000","5A",828.75,{"v":3898,"d":"3,898.00"},"no W-Extension","C","A","8506501090","DE",3,"0.051","1 unit contains 10 batteries. If 20 pcs needed, order 2 unit",null,"Package quantity changed from 30pcs to 10pcs","4060039071934"]
[null,"7050 003 59436","FNX-425U-COVWH","F.01U.359.436","Cover white for AVENAR all-in-one 4000","5A",{"v":123,"d":"123.00"},{"v":579,"d":"579.00"},"no W-Extension","C","A","8531900000","DE",20,"0.036","1 unit contains 10 covers; if 50 pcs needed, order 5 unit",null,null,"4060039071910"]
[null,"7050 003 59437","FNX-425U-COVRD","F.01U.359.437","Cover red for AVENAR all-in-one 4000","5A",{"v":123,"d":"123.00"},{"v":579,"d":"579.00"},"no W-Extension","C","A","8531900000","DE",1,"0.036","1 unit contains 10 covers; if 50 pcs needed, order 5 unit",null,null,"4060039071927"]
[null,"Acoustic Signalling Devices",null,"",{"$nulls":4},"",{"$nulls":4},"",""]
[null,"7050 002 68723","FNM-420V-A-RD","F.01U.268.723","LSN Voice Sounder Indoor, Red","5A",{"v":192.2,"d":"192.20"},{"v":904,"d":"904.00"},"no W-Extension","C","A",8531103000,"CN",19,"0.222","Delivery without battery.  Order batteries separately (FNM-BATTERIES; F.01U.168.622 )",null,null,8717332880942]
[null,"7051 002 68724","FNM-420V-A-WH","F.01U.268.724","LSN Voice Sounder Indoor, White","5A",{"v":192.2,"d":"192.20"},{"v":904,"d":"904.00"},"no W-Extension","C","A",8531103000,"CN",12,"0.222","Delivery without battery. Order batteries separately (FNM-BATTERIES; F.01U.168.622 )",null,null,8717332880942]
[null,"7050 001 68575","FNM-420U-A-BSWH","F.01U.168.575","Base Sounder Indoor uninterruptible, wh","5A",162.54,{"v":765,"d":"765.00"},"no W-Extension","C","A",8531103000,"CN",2179,"0.215","Battery is included; Cover is not included",null,null,8717332770762]
[null,"7050 001 68576","FNM-420U-A-BSRD","F.01U.168.576","Base Sounder Indoor uninterruptible, rd","5A",162.54,{"v":765,"d":"765.00"},"no W-Extension","C","A",8531103000,"CN",28,"0.215","Battery is included;  Cover is included",null,null,8717332770779]
[null,"7050 001 68577","FNM-420U-A-RD","F.01U.168.577","Sounder Indoor uninterruptible, red","5A",170.62,{"v":803,"d":"803.00"},"no W-Extension","C","A",8531103000,"CN",348,"0.245",{"$nulls":3},8717332770786]
[null,"7050 001 68578","FNM-420U-A-WH","F.01U.168.578","Sounder Indoor uninterruptible, white","5A",170.62,{"v":803,"d":"803.00"},"no W-Extension","C",1,8531103000,"CN",354,"0.245",{"$nulls":3},8717332770793]
[null,"7050 001 68579","FNM-420U-B-RD","F.01U.168.579","Sounder Outdoor uninterruptible, red","5A",188.03,{"v":884,"d":"884.00"},"no W-Extension","C","A",8531103000,"CN",86,"0.325",{"$nulls":3},8717332770809]
[null,"7050 001 68622","FNM-BATTERIES","F.01U.168.622","Batteries for FNM-420U Sounders (20pcs multipack)","5A",341.23,{"v":1605,"d":"1,605.00"},"no W-Extension","C","A",8531103000,"CN",9,"0.45","Delivered in packages of 20 pcs. If 40 pcs needed, order 2 pcs.",null,null,8717332770823]
[null,"7050 006 64687","FNM-420-A-BS-WH","F.01U.064.687","Base Sounder Indoor, White","5A",{"v":135.1,"d":"135.10"},{"v":636,"d":"636.00"},"no W-Extension","C",1,8531103000,"CN",390,"0.198","Cover is not included",null,null,8717332311323]
[null,"7050 006 64688","FNM-420-A-BS-RD","F.01U.064.688","Base Sounder Indoor, Red, LSNimpr.","5A",{"v":135.1,"d":"135.10"},{"v":636,"d":"636.00"},"no W-Extension","C",1,8531103000,"CN",105,"0.21","Cover is included",null,null,8717332311330]
[null,"7050 006 64689","FNM-420-A-WH","F.01U.064.689","Sounder Indoor, White","5A",140.67,{"v":662,"d":"662.00"},"no W-Extension","C","A",8531103000,"CN",36,"0.25",{"$nulls":3},8717332311347]
[null,"7050 006 64690","FNM-420-A-RD","F.01U.064.690","Sounder Indoor, Red","5A",140.67,{"v":662,"d":"662.00"},"no W-Extension","C",1,8531103000,"CN",178,"0.216",{"$nulls":3},8717332311354]
[null,"7050 006 64691","FNM-420-B-RD","F.01U.064.691","Sounder Outdoor, Red","5A",164.49,{"v":774,"d":"774.00"},"no W-Extension","C",1,8531103000,"CN",55,"0.299",{"$nulls":3},8717332311361]
[null,"7050 006 64694","FNM-COVER-RD","F.01U.064.694","Cover for Base Sounder, Red","5A",108.81,{"v":512,"d":"512.00"},"no W-Extension","C","A",8531103000,"Slovakia",4,"0.25","Delivered in packages of 10 pcs. If 30 pcs needed, order 3 pcs.",null,null,8717332311392]
[null,"7050 006 64695","FNM-COVER-WH","F.01U.064.695","Cover for Base Sounder, White","5A",108.81,{"v":512,"d":"512.00"},"no W-Extension","C","A",8531103000,"Slovakia",17,"0.25","Delivered in packages of 10 pcs. If 30 pcs needed, order 3 pcs.",null,null,8717332311408]
[null,"7050 006 64692","FNM-SPACER-WH","F.01U.064.692","Spacer for Surf. Cabl., White, FNM-420","5A",169.74,{"v":798,"d":"798.00"},"no W-Extension","C",1,8531103000,"CN",64,"0.49","Delivered in packages of 10 pcs. If 30 pcs needed, order 3 pcs.",null,null,8717332311378]
[null,"7050 006 64693","FNM-SPACER-RD","F.01U.064.693","Spacer for Surf. Cabl., Red, FNM-420","5A",169.74,{"v":798,"d":"798.00"},"no W-Extension","C","A",8531103000,"CN",5,"0.49","Delivered in packages of 10 pcs. If 30 pcs needed, order 3 pcs.",null,null,8717332311385]
[null,"6627 993 50351","DS10-24V","2.799.350.351","DS 10 DIN-tone sounder, 24 V, 110 dB, surface mounted","5A",559.06,{"v":2630,"d":"2,630.00"},"on demand","C","A",8531900000,"DE",6,"1.935",null,"SBN",null,8717332019199]
[null,"6627 993 50352","DS10-230V","2.799.350.352","DS 10 DIN-tone sounder, 220V 110dB,  surface mounted","5A",597.36,{"v":2810,"d":"2,810.00"},"on demand","C","C",8531900000,"DE",1,"2.217",null,"SBN",null,8717332019205]
[null,"7050 001 43878","FNM-320-SRD","F.01U.143.878","FNM-320-SRD Sounder, Surface-mount, Red","5A",63.11,{"v":297,"d":"297.00"},"no W-Extension","C","A",8531103000,"CN",161,"0.252",{"$nulls":3},8717332494477]
[null,"7050 001 43879","FNM-320-FRD","F.01U.143.879","FNM-320-FRD Sounder, Flush-mount, Red","5A",59.19,{"v":278,"d":"278.00"},"no W-Extension","C","A",8531103000,"CN",31,"0.238",{"$nulls":3},8717332494484]
[null,"7050 001 43880","FNM-320-SWH","F.01U.143.880","FNM-320-SRD Sounder, Surface-mount, Whit","5A",63.11,{"v":297,"d":"297.00"},"no W-Extension","C","A",8531103000,"CN",61,"0.242",{"$nulls":3},8717332494491]
[null,"7050 001 43881","FNM-320-FWH","F.01U.143.881","FNM-320-FRD Sounder, Flush-mount, White","5A",59.19,{"v":278,"d":"278.00"},"no W-Extension","C","A",8531103000,"CN",73,"0.238",{"$nulls":3},8717332494507]
[null,"7050 001 43882","FNM-320LED-SRD","F.01U.143.882","FNM-320LED-SRD Sounder with LED, Surface","5A",135.79,{"v":639,"d":"639.00"},"no W-Extension","C","A",8531103000,"CN",73,"0.292",{"$nulls":3},8717332494514]
[null,"7050 003 93222","PA 10-SSM","F.01U.393.222","Industrial sounder, high","5A",552.21,{"v":2598,"d":"2,598.00"},"no W-Extension","C","A",85318070,"DE",0,"1.060",{"$nulls":3},4060039128270]
[null,"7050 003 93223","PA 5","F.01U.393.223","Industrial sounder, low","5A",331.73,{"v":1560,"d":"1,560.00"},"no W-Extension","C","A",85318070,"DE",1,"0.640",{"$nulls":3},4060039128287]
[null,null,"BexS110D-24 DC","F.01U.426.429","Ex-proof sounder, performance ","5A",{"v":3952.5,"d":"3,952.50"},{"v":18593,"d":"18,593.00"},"no W-Extension","C","A",85311030,"UK",null,"3.160",{"$nulls":3},4060039201850]
[null,"Optical Signalling Devices",null,"",{"$nulls":4},"",{"$nulls":4},"",""]
[null,"7050 002 88456","SOL-LX-C-WF-W-S","F.01U.288.456","Beacon Ceiling, white flash/ white/ shallow","5A",107.23,{"v":504,"d":"504.00"},"no W-Extension","C","A",8531103000,"CN",45,"0.105",{"$nulls":3},8717332925155]
[null,"7050 002 88457","SOL-LX-C-RF-W-S","F.01U.288.457","Beacon Ceiling, red flash/ white/ shallow","5A",107.23,{"v":504,"d":"504.00"},"no W-Extension","C","A",8531103000,"CN",52,"0.105",{"$nulls":3},8717332925162]
[null,"7050 002 88458","SOL-LX-C-WF-W-D","F.01U.288.458","Beacon Ceiling, white flash/ white/deep","5A",107.23,{"v":504,"d":"504.00"},"no W-Extension","C","C",8531103000,"CN",0,"0.136",{"$nulls":3},8717332925179]
[null,"7051 002 88459","SOL-LX-C-RF-W-D","F.01U.288.459","Beacon Ceiling, red flash/ white/deep","5A",107.23,{"v":504,"d":"504.00"},"no W-Extension","C","A",8531103000,"CN",19,"0.136",{"$nulls":3},8717332925186]
[null,"7051 002 88460","SOL-LX-W-WF-W-S","F.01U.288.460","Beacon Wall, white flash /white/shallow","5A",107.23,{"v":504,"d":"504.00"},"no W-Extension","C","A",8531103000,"CN",7,"0.105",{"$nulls":3},8717332925193]
[null,"7051 002 88461","SOL-LX-W-RF-W-S","F.01U.288.461","Beacon Wall, red flash /white/shallow","5A",107.23,{"v":504,"d":"504.00"},"no W-Extension","C","A",8531103000,"CN",4,"0.105",{"$nulls":3},8717332925209]
[null,"7052 002 88462","SOL-LX-W-WF-W-D","F.01U.288.462","Beacon Wall, white flash /white/deep","5A",107.23,{"v":504,"d":"504.00"},"no W-Extension","C","A",8531103000,"CN",10,"0.136",{"$nulls":3},8717332925216]
[null,"7052 002 88463","SOL-LX-W-RF-W-D","F.01U.288.463","Beacon Wall, red flash /white/deep","5A",107.23,{"v":504,"d":"504.00"},"no W-Extension","C","A",8531103000,"CN",13,"0.136",{"$nulls":3},8717332925223]
[null,"7052 002 88464","SOL-LX-W-WF-R-S","F.01U.288.464","Beacon Wall, white flash /red/shallow","5A",107.23,{"v":504,"d":"504.00"},"no W-Extension","C","A",8531103000,"CN",20,"0.105",{"$nulls":3},8717332925230]
[null,"7053 002 88465","SOL-LX-W-RF-R-S","F.01U.288.465","Beacon Wall, red flash /red/shallow","5A",107.23,{"v":504,"d":"504.00"},"no W-Extension","C","A",8531103000,"CN",20,"0.105",{"$nulls":3},8717332925247]
[null,"7053 002 88466","SOL-LX-W-WF-R-D","F.01U.288.466","Beacon Wall, white flash /red/deep","5A",107.23,{"v":504,"d":"504.00"},"no W-Extension","C","A",8531103000,"CN",12,"0.105",{"$nulls":3},8717332925254]
[null,"7053 002 88467","SOL-LX-W-RF-R-D","F.01U.288.467","Beacon Wall, red flash /red/deep","5A",107.23,{"v":504,"d":"504.00"},"no W-Extension","C","A",8531103000,"CN",61,"0.136",{"$nulls":3},8717332925261]
[null,"7050 001 24386","FNS-P400RTH-R","F.01U.124.386","Rotating Beacon Red","5A",237.47,{"v":1117,"d":"1,117.00"},"no W-Extension","C","A",85318070,"DE",1,"0.818",{"$nulls":3},8717332402854]
[null,"7050 001 24387","FNS-P400RTH-Y","F.01U.124.387","Rotating Beacon Yellow","5A",237.47,{"v":1117,"d":"1,117.00"},"no W-Extension","C","A",85318070,"DE",1,"0.801",{"$nulls":3},8717332402861]
[null,"7050 001 43883","FNS-320-SRD","F.01U.143.883","FNS-320-SRD Beacon, Surface-mount, Red","5A",76.17,{"v":358,"d":"358.00"},"no W-Extension","C","A",8531103000,"CN",47,"0.216",{"$nulls":3},8717332494521]
[null,"7050 001 43884","FNS-320-SYE","F.01U.143.884","FNS-320-SYE Beacon, Surface-mount, Amber","5A",76.17,{"v":358,"d":"358.00"},"no W-Extension","C","A",8531103000,"CN",10,"0.172",{"$nulls":3},8717332494538]
[null,"7050 001 43885","FNS-320-SWH","F.01U.143.885","FNS-320-SWH Beacon, Surface-mount, White","5A",76.17,{"v":358,"d":"358.00"},"no W-Extension","C","A",8531103000,"CN",4,"0.291",{"$nulls":3},8717332494545]
[null,"7050 001 43886","FNS-320-SGR","F.01U.143.886","FNS-320-SGR Beacon, Surface-mount, Green","5A",76.17,{"v":358,"d":"358.00"},"no W-Extension","C","A",8531103000,"CN",2,"0.291",{"$nulls":3},8717332494552]
[null,"6650 005 16089","FNS-420-R","F.01U.516.089","Strobe for base sounder red","5A",131.48,{"v":618,"d":"618.00"},"on demand","C","A",8531900000,"CN",274,"0.077",null,null,"Not allowed for fire applications within the EU.",8717332282999]
[null,"7050 001 32440","FNA-P400RBA-MB","F.01U.132.440","Mounting Bracket for FNS-P400RTH","5A",61.11,{"v":287,"d":"287.00"},"no W-Extension","C","A",3926909790,"DE",1,"0.095",{"$nulls":3},8717332457519]
[null,"7050 003 93220","PY X-M-10-SSM R","F.01U.393.220","Industrial strobe SSM, red","5A",508.99,{"v":2394,"d":"2,394.00"},"no W-Extension","C","A",85318070,"DE",0,"0.440",{"$nulls":3},4060039128256]
[null,"7050 003 93221","PY X-M-10-SSM W","F.01U.393.221","Industrial strobe SSM, white","5A",508.99,{"v":2394,"d":"2,394.00"},"no W-Extension","C","A",85318070,"DE",3,"0.440",{"$nulls":3},4060039128263]
[null,"Optical + Acoustical Signalling Devices Combination",{"$nulls":6},"",{"$nulls":4},"",""]
[null,"7050 002 88468","ROLP-W-LX-W-WF","F.01U.288.468","Sounder Beacon, white /wall/white flash","5A",155.98,{"$f":"ROUND(ROUND(G456*4.704,2),0)","v":{"v":734,"d":"734.00"}},"no W-Extension","C","A",8531103000,"CN",24,"0.283",{"$nulls":3},8717332925278]
[null,"7050 002 88469","ROLP-W-LX-W-RF","F.01U.288.469","Sounder Beacon, white/wall/red flash","5A",155.98,{"v":734,"d":"734.00"},"no W-Extension","C","A",8531103000,"CN",25,"0.283",{"$nulls":3},8717332925285]
[null,"7050 002 88470","ROLP-R-LX-W-WF","F.01U.288.470","Sounder Beacon, red/wall/white flash","5A",155.98,{"v":734,"d":"734.00"},"no W-Extension","C","A",8531103000,"CN",39,"0.283",{"$nulls":3},8717332925292]
[null,"7050 002 88471","ROLP-R-LX-W-RF","F.01U.288.471","Sounder Beacon, red/wall/red flash","5A",155.98,{"v":734,"d":"734.00"},"no W-Extension","C","A",8531103000,"CN",160,"0.283",{"$nulls":3},8717332925308]
[null,"Test Equipments",null,"",{"$nulls":4},"",{"$nulls":4},"",""]
[null,"6650 005 08720","FAA-500-RTL","F.01U.508.720","FAA-500-RTL removal tool","5A",{"v":1093.37,"d":"1,093.37"},{"v":5143,"d":"5,143.00"},"no W-Extension","C","A",8205598000,"GB",0,"0.785",null,"SBN",null,"8717332097692"]
[null,"6650 005 08725","FAA-500-TTL","F.01U.508.725","FAA-TTL Test adapter with magnet  ","5A",485.27,{"v":2283,"d":"2,283.00"},"no W-extension","S","A",3926909790,"GB",2,"0.116",null,"SBN",null,"8717332097708"]
[null,"7050 003 63162","SOLO461","F.01U.363.162","Cordless heat detector test kit","5A",{"v":1944.71,"d":"1,944.71"},{"v":9148,"d":"9,148.00"},"no W-Extension","C","A",3926909790,"GB",1,"2.35",null,"SBN",null,4060039081209]
[null,"6649 981 12071","SOLO330","4.998.112.071","Test device for optical smoke detectors","5A",546.07,{"v":2569,"d":"2,569.00"},"no W-Extension","C","A",3926909790,"GB",5,"0.73",null,"SBN",null,8717332003600]
[null,"7050 003 45557","FME-SOLO-A10S","F.01U.345.557","Test Aerosol spray for Optical Smoke Detectors","5A",74.81,{"v":352,"d":"352.00"},"no W-Extension","C","A",4911990000,"GB",439,"0.24","Order only 12 pcs or multiple of 12. E.g. needed 30 pcs, order 36 pcs","-",null,4060039009142]
[null,"7050 003 01469","FME-TEST-CO","F.01U.301.469","Spray with CO testing gas for multisensor detectors with C-component","5A",80.27,{"v":378,"d":"378.00"},"no W-Extension","C","A",3824840000,"GB",51,"0.05",null,"-",null,8717332955183]
[null,"6649 981 12073","SOLO610","4.998.112.073","Carry bag for Solo service kit","5A",363.65,{"v":1711,"d":"1,711.00"},"no W-Extension","C","A",4202929890,"GB",5,"2.52",null,"-",null,8717332020447]
[null,"7050 003 63163","SOLO770","F.01U.363.163","SOLO770 Spare battery- pack","5A",395.27,{"v":1859,"d":"1,859.00"},"no W-Extension","C","A",3926909790,"GB","","0.466",null,"SBN",null,4060039081216]
[null,"6649 981 12113","SOLO200","4.998.112.113","Universal detector removal tool without pole","5A",{"v":728.5,"d":"728.50"},{"v":3427,"d":"3,427.00"},"no W-Extension","C","A",8205598000,"GB",1,"1.221",null,"SBN",null,8717332003679]
[null,"6649 981 12069","SOLO100","4.998.112.069","Extension pole for detector removal tool - 1-3,4m","5A",{"v":1336.61,"d":"1,336.61"},{"v":6287,"d":"6,287.00"},"no W-Extension","C","A",3926909790,"GB",4,"1.04","In US the product is called SOLO 100, in other countries SOLO106-126, see changed datasheet","SBN",null,8717332003587]
[null,"6649 981 12070","SOLO101","4.998.112.070","Fibreglass extension rod (1m)","5A",278.51,{"v":1310,"d":"1,310.00"},"no W-Extension","C","A",3926909790,"GB",10,"0.38",null,"SBN",null,8717332003594]
[null,"6649 980 82502","RTL-cap","4.998.082.502","Plastic cap for detector removal tool, 2 pcs are needed","5A",31.62,{"v":149,"d":"149.00"},"no W-Extension","C","A",3926909790,"GB",3,"0.083",null,"-",null,8717332020089]
[null,705000169803,"FME-420-LSN-TTL","F.01U.169.803","LSN improved Test Tool","5A",{"v":4993.8,"d":"4,993.80"},{"v":23491,"d":"23,491.00"},"no W-Extension","C","C",90303900,"DE",4,"5.092",{"$nulls":3},8717332774494]
[null,"Fire Service Control Panel and Door Control Units",{"$nulls":6},"",{"$nulls":4},"",""]
[null,"Fire Service Control Panel",null,"",{"$nulls":4},"",{"$nulls":4},"",""]
[null,705000288669,"FMF-ADP-TTY","F.01U.288.669","Fire Brigade Peripheral Ring Bus Module TTY interface","5A",552.47,{"v":2599,"d":"2,599.00"},"no W-Extension","C","C",8538909999,"DE",11,"0.184",null,"-",null,8717332925537]
[null,705000317733,"FMF-ADP-FBF","F.01U.317.733","Fire Brigade Peripheral Ring Bus Module for UEZ-2000 and BZ-500","5A",754.05,{"v":3547,"d":"3,547.00"},"no W-Extension","C","C",8538909999,"DE",0,0.2,null,"-",null,8717332541201]
[null,"F.01U.288.674","FMF-FBF-FAT","F.01U.288.674","Fire Brigade Peripheral FAT and FBF","5A",{"v":1523.77,"d":"1,523.77"},{"v":7168,"d":"7,168.00"},"no W-Extension","C","C",8531103000,"DE",3,3.72,null,"-","only German version",8717332925582]
[null,"F.01U.288.675","FMF-ESPA","F.01U.288.675","ESPA interface","5A",228.77,{"v":1076,"d":"1,076.00"},"no W-Extension","C","C",8531103000,"DE",0,0.14,null,"-",null,8717332925599]
[null,"F.01U.288.676","FMF-FIBS-A4","F.01U.288.676","Fire brigade information center A4","5A",{"v":2647.31,"d":"2,647.31"},{"v":12453,"d":"12,453.00"},"no W-Extension","C","C",8531103000,"DE",0,17.74,null,"-","only German version",8717332925605]
[null,"F.01U.288.677","FMF-FIBS-A3","F.01U.288.677","Fire brigade information center A3","5A",{"v":2647.31,"d":"2,647.31"},{"v":12453,"d":"12,453.00"},"no W-Extension","C","C",8531103000,"DE",0,24,null,"-","only German version",8717332925612]
[null,"F.01U.288.706","FMF-FAT","F.01U.288.706","Fire Brigade Peripheral FAT","5A",{"v":1089.4,"d":"1,089.40"},{"v":5125,"d":"5,125.00"},"no W-Extension","C","C",8531103000,"DE",0,2.2,null,"-","only German version",8717332925735]
[null,"Accessories Fire Service Control Panel",null,"",{"$nulls":4},"",{"$nulls":4},"",""]
[null,"not in MFG","SD-A","2.799.360.424","FSK-A, with housing","5A",{"v":503.4,"d":"503.40"},{"v":2368,"d":"2,368.00"},"no W-Extension","C","C",8531900000,"NL",0,"0.828",null,null,"only German version"]
[null,665000033702,"FMS-KR-BASIC-RPF","F.01U.033.702","Key deposit Kruse FSD 2003 12/24V-Rain","5A",{"v":2168.75,"d":"2,168.75"},{"v":10202,"d":"10,202.00"},"no W-Extension","C","D",8303009000,"DE",0,"12.623",null,null,"only German version",8717332289899]
[null,"6650 000 33703","FMS-KR-BASIC","F.01U.033.703","Key deposit Kruse FSD 2003 12/24V","5A",{"v":1754.85,"d":"1,754.85"},{"v":8255,"d":"8,255.00"},"no W-Extension","C","D",8303009000,"DE",0,"14.0",null,null,"only German version",8717332289905]
[null,"not in MFG","BS DKM/FIPS","4.998.149.388","BS for installation DKM in FIBS","5A",100.98,{"v":475,"d":"475.00"},"no W-Extension","C","A",7326909890,"DE",1,"0.125",null,null,"only German version",""]
[null,"Door Control Unit",null,"",{"$nulls":4},"",{"$nulls":4},"",""]
[null,"6627 993 30300","TSZ 0400 LSN","2.799.330.300","TSZ 0400 Door control unit","5A",552.05,{"v":2597,"d":"2,597.00"},"no W-Extension","C","A",8531900000,"DE",5,"0.642",null,null,"only German version",8717332020836]
[null,"6627 993 20540","FMD-432","2.799.320.540","Push button type 432 flush-mount","5A",65.13,{"v":306,"d":"306.00"},"no W-Extension","C","A",8536501999,"DE",3,"0.1",null,null,"only German version",8717332019038]
[null,"6627 993 20541","FMD-432-S","2.799.320.541","TYPE 432 PUSH BUTTON FOR SURFACE MOUNTING","5A",39.08,{"v":184,"d":"184.00"},"no W-Extension","C","A",8536501999,"DE",8,"0.083",null,null,"only German version",8717332020829]
[null,"6627 993 20503","FMD-F.GT60","2.799.320.503","ASS65 ANCHOR PLATE FOR GT60","5A",79.82,{"v":375,"d":"375.00"},"no W-Extension","C","A",8505902999,"DE",4,"0.27",null,null,"only German version",8717332002962]
[null,"6627 993 20504","FMD-GT60","2.799.320.504","GT60R DOOR HOLD MAGNET 24V/686N, WALL MOUNTING ","5A",{"v":248.1,"d":"248.10"},{"v":1167,"d":"1,167.00"},"no W-Extension","C","A",8505902999,"DE",4,"0.48",null,null,"only German version",8717332002948]
[null,"6627 993 20532","FMD-GT50","2.799.320.532","GT50R DOOR HOLD MAGNET 24V/490N, FLOOR MOUNTING","5A",456.79,{"v":2149,"d":"2,149.00"},"no W-Extension","C","A",8505902999,"DE",1,"0.59",null,null,"only German version",8717332002979]
[null,"6627 993 20536","FMD-F.GT50","2.799.320.536","ASS55 ANCHOR PLATE FOR GT50","5A",60.24,{"v":283,"d":"283.00"},"no W-Extension","C","A",8505909090,"DE",2,"0.098",null,null,"only German version",8717332019021]
[null,"6627 993 20539","FMD-GT50-space","2.799.320.539","GT50R WITH SPACER PIPE DOOR HOLD MAGNET, UNIV","5A",422.25,{"v":1986,"d":"1,986.00"},"no W-Extension","C","A",8505909090,"DE",1,"1.41",null,null,"only German version",8717332002986]
[null,"Training ","","",{"$nulls":4},"",{"$nulls":4},""]
[null,null,"TRA-FIR-FL","F.01U.328.621","Training Fire Alarm Systems","T3",{"v":900,"d":"900.00"},{"v":4234,"d":"4,234.00"},"no W-Extension","n.a.","n.a.","n.a.","n.a","n.a.","No physical product",null,null,"Price per person for 1 training / local, customized training organized by BU",8717332951796]
[null,null,"TRA-FPA-FE","F.01U.350.356","Training FPA-5000 - Expert","T3",{"v":600,"d":"600.00"},{"v":2822,"d":"2,822.00"},"no W-Extension","n.a.","n.a.","n.a.","n.a","n.a.","No physical product",null,null,"Price per person for a 2-day FPA training / organized by BU",4060039025128]
[null,null,"TRA-FPA-FM","F.01U.350.357","Training FPA-5000 - Master","T3",{"v":600,"d":"600.00"},{"v":2822,"d":"2,822.00"},"no W-Extension","n.a.","n.a.","n.a.","n.a","n.a.","No physical product",null,null,"Price per person for a 2-day FPA training / organized by BU",4060039025135]

{"sheet":"Fire EN 54","index":7,"n_rows":508,"n_cols":19,"rows_kept":508,"hidden":true}
["Change Indicator",null,"BU Fire reference REUP List Q1-2 / 2026   -   V1.0"]
[null,"12 NC","CTN","SAPnumber","Description","Discount Category","2026-01-01","FX=4,704 REUP PL valid 01.01.2026","Warranty Period (years)","Status","ABC Code","HS Code","Country of Origin","Spike order","Net weight \n(kg)","Order Info","Repair process","Remarks","EAN code single"]
[null,"Modular Panel"]
[null,"AVENAR panel modules "]
[null,"7050 000 81384","BCM-0000-B","F.01U.081.384","BCM 0000 B  Battery Controller Module","5A",220.24,{"$f":"ROUND(ROUND(G5*4.704,2),0)","v":{"v":1036,"d":"1,036.00"}},5,"C",1,8537109199,"CN",148,"0.342",null,"SBN",null,800549180153]
[null,"6649 981 37262","ANI 0016 A","4.998.137.262","ANI 0016 A  16 Point Annunciator internal","5A",132.15,{"$f":"ROUND(ROUND(G6*4.704,2),0)","v":{"v":622,"d":"622.00"}},5,"C","A",8537109199,"CN",7,"0.26",null,"SBN",null,8717332205882]
[null,"6649 981 37265","RML 0008 A","4.998.137.265","RML 0008 A  Relay Low Voltage","5A",176.18,{"v":829,"d":"829.00"},5,"C",1,8537109199,"CN",98,"0.306",null,"SBN",null,8717332205912]
[null,"6649 981 37266","IOS 0020 A","4.998.137.266","IOS 0020 A  20mA Communication Module","5A",{"v":479.4,"d":"479.40"},{"v":2255,"d":"2,255.00"},5,"C",1,8537109199,"CN",15,"0.594",null,"SBN",null,8717332205929]
[null,"6649 981 37267","IOS 0232 A","4.998.137.267","IOS 0232 A  RS232 Communication Module","5A",264.29,{"v":1243,"d":"1,243.00"},5,"C","A",8537109199,"CN",4,"0.233",null,"SBN",null,8717332205936]
[null,"6649 981 37269","IOP 0008 A","4.998.137.269","IOP 0008 A  8 input/output OC module","5A",{"v":241.9,"d":"241.90"},{"v":1138,"d":"1,138.00"},5,"C",1,8537109199,"CN",17,"0.299",null,"SBN",null,8717332205943]
[null,"6649 981 37270","CZM 0004 A","4.998.137.270","CZM 0004 A  4 Zone Conventional Zone Module","5A",{"v":477.6,"d":"477.60"},{"v":2247,"d":"2,247.00"},5,"C",1,8537109199,"CN",52,"0.333",null,"SBN",null,8717332205950]
[null,"7050 000 63204","ENO 0000 B","F.01U.063.204","ENO 0000 B (External Notification)","5A",352.38,{"v":1658,"d":"1,658.00"},5,"C",1,8537109199,"CN",79,"0.27",null,"SBN",null,800549134231]
[null,"6649 981 37274","RMH 0002 A","4.998.137.274","RMH 0002 A  2 Zone Relay high voltage","5A",403.18,{"v":1897,"d":"1,897.00"},5,"C","A",8537109199,"CN",15,"0.31",null,"SBN",null,8717332205998]
[null,"6649 981 37275","NZM 0002 A","4.998.137.275","NZM 0002 A  2 Zone NAC Zone Module","5A",352.38,{"v":1658,"d":"1,658.00"},5,"C",1,8537109199,"CN",37,"0.306",null,"SBN",null,8717332206001]
[null,"6650 000 28289","FPE-5000-UGM","F.01U.028.289","UGM interface module","5A",465.13,{"v":2188,"d":"2,188.00"},5,"C","A",8537109199,"CN",32,"0.27",null,"SBN",null,8717332260041]
[null,"6649 981 37277","LSN 0300 A","4.998.137.277","LSN 0300 A  LSN Module","5A",514.81,{"v":2422,"d":"2,422.00"},5,"C",1,8538909999,"CN",462,"0.306",null,"SBN",null,8717332206018]
[null,"6649 981 37278","LSN 1500 A","4.998.137.278","LSN 1500 A, LSN improved Module","5A",{"v":1023.43,"d":"1,023.43"},{"v":4814,"d":"4,814.00"},5,"C","A",8538909999,"CN",27,"0.68",null,"SBN",null,8717332309719]
[null,"6649 981 37279","PRS-0002-C","F.01U.284.903","PRS-0002-C  Panel Rail Short","5A",59.75,{"v":281,"d":"281.00"},5,"C","A",8536901000,"CN",165,"0.45",null,"SBN",null,8717332206025]
[null,"6649 981 37280","PRD 0004 A","4.998.137.280","PRD 0004 A  Panel Rail long","5A",149.77,{"v":705,"d":"705.00"},5,"C",1,8536901000,"CN",129,"0.72",null,"SBN",null,8717332206032]
[null,"AVENAR panel 8000 ",null,"",{"$nulls":4},"",{"$nulls":4},"",""]
[null,"7050 003 27090","FPE-8000-SPC","F.01U.327.090","Panel controller, standard license","5A",855.96,{"v":4026,"d":"4,026.00"},5,"C","A",8537109199,"PT",24,3.191,null,"SBN",null,8717332940417]
[null,"7050 003 52441","FPE-8000-PPC","F.01U.352.441","Panel controller, premium license","5A",{"v":1470.02,"d":"1,470.02"},{"v":6915,"d":"6,915.00"},5,"C","A",8537109199,"PT",27,3.191,null,"SBN",null,4060039031174]
[null,"AVENAR panel 8000 Housings for Frame Installation",{"$nulls":6},"",{"$nulls":4},"",""]
[null,"6649 981 37290","CPH 0006 A","4.998.137.290","CPH 0006 A  Backbox CABT 1 rail","5A",524.37,{"v":2467,"d":"2,467.00"},5,"C",1,8538909999,"CN",68,"12.34",null,"SBN",null,8717332206131]
[null,"6649 981 37291","MPH 0010 A","4.998.137.291","MPH 0010 A  Backbox CABT 2 Rails","5A",660.71,{"v":3108,"d":"3,108.00"},5,"C",1,8538909999,"CN",74,"13.85",null,"SBN",null,8717332206148]
[null,"6649 981 37292","EPH 0012 A","4.998.137.292","EPH 0012 A  Backbox 3 rails","5A",{"v":1122.67,"d":"1,122.67"},{"v":5281,"d":"5,281.00"},5,"C",1,8538909999,"CN",21,"14.55",null,"SBN",null,8717332206155]
[null,"6649 981 37293","PSF 0002 A","4.998.137.293","PSF 0002 A  Power-small-frame","5A",354.28,{"v":1667,"d":"1,667.00"},5,"C",1,8538909999,"CN",54,"7.723",null,"SBN",null,8717332206162]
[null,"6650 005 11306","PMF 0002 A","F.01U.511.306","PMF 0002 A  Power-medium-frame","5A",357.41,{"v":1681,"d":"1,681.00"},5,"C","A",3926909790,"CN",124,"12.726",null,"SBN",null,8717332206667]
[null,"6649 981 37294","PMF 0004 A","4.998.137.294","PMF 0004 A  Power-medium-frame","5A",409.57,{"v":1927,"d":"1,927.00"},5,"C",1,8538909999,"CN",64,"12.132",null,"SBN",null,8717332206179]
[null,"6649 981 47119","USF 0000 A","4.998.147.119","USF 0000 A  Universal housing-small-frame","5A",340.84,{"v":1603,"d":"1,603.00"},5,"C","A",8538909999,"CN",13,"7.489",null,"SBN",null,8717332206315]
[null,"6649 981 37296","FBH 0000 A","4.998.137.296","FBH 0000 A  Mounting frame large","5A",{"v":178.3,"d":"178.30"},{"v":839,"d":"839.00"},5,"C",1,3926909790,"CN",500,"4.822",null,"SBN",null,8717332206193]
[null,"6649 981 37297","FMH 0000 A","4.998.137.297","FMH 0000 A  Mounting frame medium","5A",131.09,{"v":617,"d":"617.00"},5,"C",1,3926909790,"CN",150,"4.137",null,"SBN",null,8717332206209]
[null,"6649 981 37298","FSH 0000 A","4.998.137.298","FSH 0000 A  Mounting frame small","5A",104.89,{"v":493,"d":"493.00"},5,"C","A",3926909790,"CN",20,"2.362",null,"SBN",null,8717332206216]
[null,"7050 002 66845","FPM-5000-KMC","F.01U.266.845","mounting kit for media converter","5A",443.13,{"v":2084,"d":"2,084.00"},5,"C","A",85189000,"DE",7,"0.86",null,"SBN",null,8717332875269]
[null,"6650 005 11305","HMP 0003 A","F.01U.511.305","HMP 0003 A, installation plate for mounting frame","5A",132.15,{"v":622,"d":"622.00"},5,"C","A",3926909790,"CN",8,"0.383",null,"SBN",null,8717332206650]
[null,"6649 981 39498","FRB 0019 A","4.998.139.498","FRB 0019 A  19\" Frame Rack X Rails","5A",140.95,{"v":663,"d":"663.00"},5,"C","A",7326909890,"CN",10,"4.813",null,"SBN",null,8717332206278]
[null,"6649 981 39499","FRM 0019 A","4.998.139.499","FRM 0019 A  19\" Frame Rack X Rails","5A",110.12,{"v":518,"d":"518.00"},5,"C","A",7326909890,"CN",4,"4.778",null,"SBN",null,8717332206285]
[null,"6649 981 39500","FRS 0019 A","4.998.139.500","FRS 0019 A  19\" Frame Rack X Rails","5A",{"v":96.9,"d":"96.90"},{"v":456,"d":"456.00"},5,"C","A",3926909790,"CN",3,"3.14",null,"SBN",null,8717332206292]
[null,"6650 005 00374","FDP 0001 A","F.01U.500.374","FDP 0001 A    Front Dummy cover plate","5A",17.62,{"v":83,"d":"83.00"},5,"C",1,3926909790,"CN",737,"0.1",null,"SBN",null,8717332206605]
[null,"6650 005 13251","FPO-5000-EB","F.01U.513.251","FPO-5000-EB earth bar ","5A",{"v":88.1,"d":"88.10"},{"v":414,"d":"414.00"},5,"C","A",7326909890,"CN",31,"0.111",null,"SBN",null,8717332206766]
[null,"AVENAR panel 8000 Housings for Wall Mounting ",{"$nulls":6},"",{"$nulls":4},"",""]
[null,"6649 981 37285","HCP 0006 A","4.998.137.285","HCP 0006 A  CABT 1 Rail & Common Control","5A",440.48,{"v":2072,"d":"2,072.00"},5,"C",1,8529904900,"CN",64,"13.581",null,"SBN",null,8717332206087]
[null,"6649 981 37286","HBC 0010 A","4.998.137.286","HBC 0010 A  CABT 2 Rails & Common Control","5A",660.71,{"v":3108,"d":"3,108.00"},5,"C",1,8529904900,"CN",13,"17.11",null,"SBN",null,8717332206094]
[null,"6649 981 37287","HBE 0012 A","4.998.137.287","HBE 0012 A  CABT 3 Rails","5A",{"v":1122.67,"d":"1,122.67"},{"v":5281,"d":"5,281.00"},5,"C","A",8529904900,"CN",7,"18.144",null,"SBN",null,8717332206100]
[null,"6649 981 37288","PSS 0002 A","4.998.137.288","PSS 0002 A  CABT 1 power Slot 2 batterys","5A",486.93,{"v":2291,"d":"2,291.00"},5,"C","A",3926909790,"CN",8,"7.452",null,"SBN",null,8717332206117]
[null,"6649 981 37289","PSB 0004 A","4.998.137.289","PSB 0004 A  CABT 1 power Slot 4 batterys","5A",660.71,{"v":3108,"d":"3,108.00"},5,"C","A",3926909790,"CN",10,"12.511",null,"SBN",null,8717332206124]
[null,"6650 005 11304","FRK 0019 A","F.01U.511.304","FRK 0019 A 19 inches fixing kit","5A",293.24,{"v":1379,"d":"1,379.00"},5,"C","A",7326909890,"DE",1,"2.34",null,"SBN",null,8717332263493]
[null,"7050 002 66844","FPM-5000-KES","F.01U.266.844","FPM-5000-KES mounting kit for Ethernet switch","5A",781.97,{"v":3678,"d":"3,678.00"},5,"C","A",8302500000,"DE",5,"2.77",null,"SBN",null,8717332875252]
[null,"7050 002 65641","EL1141-10B-BH","F.01U.265.641","EL1141-10B-BH Ethernet Fibre Optics Converter MM","5A",944.48,{"v":4443,"d":"4,443.00"},"3","C","A",8504409090,"TW",31,"0.58",null,"SBN",null,8717332871018]
[null,"7050 002 65643","EL1141-B0B-BH","F.01U.265.643","EL1141-10B-BH Ethernet Fibre Optics Converter SM","5A",{"v":1312.29,"d":"1,312.29"},{"v":6173,"d":"6,173.00"},"3","C","A",8504409090,"TW",23,"0.58",null,"SBN",null,8717332871032]
[null,"AVENAR panel 8000 Power Supplies ",{"$nulls":6},"",{"$nulls":4},"",""]
[null,"6650 005 00367","UPS 2416 A","F.01U.500.367","UPS 2416 Power Supply 24V/6A NAC sync","5A",431.66,{"v":2031,"d":"2,031.00"},5,"C",1,8504403090,"CN",1250,"0.97",null,"SBN",null,8717332206582]
[null,"6649 981 53243","CPB 0000 A","4.998.153.243","CPB 0000 A  Cable set P-Supply to BC ","5A",22.02,{"v":104,"d":"104.00"},5,"C","A",8544429090,"CN",700,"0.198",null,"SBN",null,8717332206520]
[null,"7050 000 78858","FPO-5000-PSB1","F.01U.078.858","PSB 1001 A  P-Supply Bracket US single ","5A",{"v":96.9,"d":"96.90"},{"v":456,"d":"456.00"},5,"C","A",3926909790,"CN",12,"1.03",null,"SBN",null,8717332342655]
[null,"7050 000 78860","FPO-5000-PSB-CH","F.01U.078.860","CPB 1002 A  P-Supply Bracket CH US","5A",123.34,{"v":580,"d":"580.00"},5,"C",1,3926909790,"CN",375,"0.798",null,"SBN",null,8717332342679]
[null,705000398453,"FPP-3000","F.01U.398.453","Power Supply","5A",595.23,{"v":2800,"d":"2,800.00"},"3","C","A",85044055,"PL",23,{"v":11,"d":"11.000"},null,"SBN",null,4060039146991]
[null,"6650 005 11307","FPP 5000","F.01U.511.307","FPP 5000, AUX power supply kit","5A",{"v":1198.08,"d":"1,198.08"},{"v":5636,"d":"5,636.00"},5,"C","B",8504900500,"NL",20,"20.7",null,"RC",null,8717332206674]
[null,"7050 001 61679","FPP-5000-TI13","F.01U.161.679","LSN interface for FPP-5000","5A",177.91,{"v":837,"d":"837.00"},5,"C","A",8531900000,"CN",111,"0.306",{"$nulls":3},8717332754281]
[null,"AVENAR panel 8000 Cable Sets",{"$nulls":6},"",{"$nulls":4},"",""]
[null,"6649 981 53244","CBB 0000 A","4.998.153.244","CBB 0000 A  Cable set BC to Battery","5A",28.63,{"v":135,"d":"135.00"},5,"C",1,8544429090,"CN",788,"0.198",null,"SBN",null,8717332206537]
[null,"7050 003 49391","FPE-8000-CRP","F.01U.349.391","Cable set redundant panel controller","5A",74.43,{"v":350,"d":"350.00"},5,"C","A",8544429090,"PT",13,0.642,null,"SBN",null,4060039022608]
[null,"7050 003 49392","FPE-8000-CRK","F.01U.349.392","Cable redundant keypad","5A",44.66,{"v":210,"d":"210.00"},5,"C","A",8544429090,"PT",25,0.258,null,"SBN",null,4060039022615]
[null,"AVENAR panel 8000 Accessories ",{"$nulls":6},"",{"$nulls":4},""]
[null,"6650 005 00374","FDP 0001 A","F.01U.500.374","FDP 0001 A    Front Dummy cover plate","5A",17.62,{"v":83,"d":"83.00"},"5","C",1,3926909790,"CN",737,"0.1",null,"SBN",null,8717332206605]
[null,"6650 005 00442","SIV 28","F.01U.500.442","SIV 28V Fuse protected distributor           ","5A",120.23,{"v":566,"d":"566.00"},"5","C","A",8531900000,"DE",5,"0.22",null,"SBN",null,8717332212309]
[null,null,"ESP-EF01U390166","F.01U.390.166","SPA Cable NTC-Resistor Magic-Panel","5A",{"v":59.8,"d":"59.80"},{"v":281,"d":"281.00"},"5","C","A",85334010,"China",null,"0.001",null,"No repair",null,4060039122308]
[null,"AVENAR keypad 8000",{"$nulls":6},"",{"$nulls":4},"",""]
[null,"7050 003 27092","FPE-8000-FMR","F.01U.327.092","Remote Keypad","5A",{"v":1507.23,"d":"1,507.23"},{"v":7090,"d":"7,090.00"},"5","C","A",8537109199,"PT",22,3.121,null,"SBN",null,8717332940431]
[null,"AVENAR panel 2000",{"$nulls":6},"",{"$nulls":4},"",""]
[null,"7050 003 27091","FPE-2000-SPC","F.01U.327.091","Panel controller AVENAR panel 2000, standard license","5A",855.96,{"$f":"ROUND(ROUND(G70*4.704,2),0)","v":{"v":4026,"d":"4,026.00"}},"5","C","A",8537109199,"PT",28,3.191,null,"SBN",null,8717332940424]
[null,"7050 003 52443","FPE-2000-PPC","F.01U.352.443","Panel controller AVENAR panel 2000, premium license","5A",{"v":1470.02,"d":"1,470.02"},{"v":6915,"d":"6,915.00"},"5","C","A",8537109199,"PT",18,3.191,null,"SBN",null,4060039031181]
[null,"7050 003 83886","FPA-2000-SWM","F.01U.383.886","Panel kit standard license, wall-mount","5A",{"v":1791.32,"d":"1,791.32"},{"$f":"ROUND(ROUND(G72*4.704*1.05,2),0)","v":{"v":8848,"d":"8,848.00"}},"5","C","A",8537109199,"PT",0,19.7,null,"SBN",null,4060039107411]
[null,"7050 003 83887","FPA-2000-SFM","F.01U.383.887","Panel kit standard license, frame-mount","5A",{"v":1926,"d":"1,926.00"},{"$f":"ROUND(ROUND(G73*4.704*1.05,2),0)","v":{"v":9513,"d":"9,513.00"}},"5","C","A",8537109199,"PT",5,22.8,null,"SBN",null,4060039107428]
[null,"7050 003 83888","FPA-2000-PWM","F.01U.383.888","Panel kit premium license, wall-mount","5A",{"v":2350.21,"d":"2,350.21"},{"$f":"ROUND(ROUND(G74*4.704*1.05,2),0)","v":{"v":11608,"d":"11,608.00"}},"5","C","A",8537109199,"PT",0,19.7,null,"SBN",null,4090039107435]
[null,"7050 003 83893","FPA-2000-PFM","F.01U.383.893","Panel kit premium license, frame-mount","5A",{"v":2478.98,"d":"2,478.98"},{"$f":"ROUND(ROUND(G75*4.704*1.05,2),0)","v":{"v":12244,"d":"12,244.00"}},"5","C","A",8537109199,"PT",2,22.8,null,"SBN",null,4060039107442]
[null,"Display Panels",{"$nulls":6},"",{"$nulls":4},"",""]
[null,"6649 980 00922","BAT 100 LSN","4.998.000.922","BAT100 LSN, Remote display panel","5A",589.39,{"v":2772,"d":"2,772.00"},"5","C","A",8537109199,"DE",3,"2.61",null,"SBN","One ATG-420-LSNi is included",8717332004584]
[null,8717332915347,"ATB 420 LSNi","F.01U.284.611","ATB 420 LSNi for the connection to location map tableaus","5A",360.34,{"v":1695,"d":"1,695.00"},"5","C","A",8538909189,"DE",11,"0.07",null,"SBN",null,8717332915347]
[null,"6649 980 01941","BAT100-LABELS","4.998.001.941","BS labeling strips for BAT 100","5A",88.95,{"v":418,"d":"418.00"},"5","C","C",3919908099,"DE",2,"0.266",null,"SBN",null,8717332019816]
[null,8531901000,"ATG 420 LSNI","F.01U.284.610","ATG 420 LSNi display module","5A",360.34,{"v":1695,"d":"1,695.00"},"5","C","C",8531209590,"CN",9,"0.055",null,"SBN",null,8717332915330]
[null,"not in MFG","ATG100-LABEL","3.902.102.662","BS labeling membranes ATG 100","5A",{"v":47.9,"d":"47.90"},{"v":225,"d":"225.00"},"5","C","C",3919908099,"DE",10,"0.349",null,"-",null,""]
[null,"BACnet Server License",{"$nulls":6},"",{"$nulls":4},""]
[null,"7050 004 28678","FSM-8000-BNSL","F.01U.428.678","BACnet server license 5 years","5A",{"v":2040,"d":"2,040.00"},{"v":9596,"d":"9,596.00"},"n.a.",null,"C","n.a.","DE",null,"n.a.",null,"n.a.",null,4060039205827]
[null,"7051 004 28679","FSM-8000-BNSTL","F.01U.428.679","BACnet server trial license 30 days","5A",{"v":45.9,"d":"45.90"},{"v":216,"d":"216.00"},"n.a.",null,"C","n.a.","DE",null,"n.a.",null,"n.a.",null,4060039205834]
[null,"Remote Services",{"$nulls":6},"",{"$nulls":4},""]
[null,"n.a.","FPO-GATE","F.01U.433.333","Secure Network Gateway","5A",956.25,{"v":4498,"d":"4,498.00"},"1","C","A",8517620000,"DE",3,1.127,{"$nulls":3},4060039034250]
[null,"n.a.","FSL-BASIC-S","F.01U.435.428","NEXOSPACE FSE basic license S","5A",318.24,{"v":1497,"d":"1,497.00"},"n.a.","C","n.a.",4911990000,"Germany",0,0,"Annual connectivity license <254 points","No physical product",null,4060039104076]
[null,"n.a.","FSL-BASIC-M","F.01U.435.594","NEXOSPACE FSE basic license M","5A",{"v":958.8,"d":"958.80"},{"v":4510,"d":"4,510.00"},"n.a.","C","n.a.",4911990000,"Germany",0,0,"Annual connectivity license 254 - 2000 points","No physical product",null,4060039112699]
[null,"n.a.","FSL-BASIC-L","F.01U.435.590","NEXOSPACE FSE basic license L","5A",{"v":1593.24,"d":"1,593.24"},{"v":7495,"d":"7,495.00"},"n.a.","C","n.a.",4911990000,"Germany",0,0,"Annual connectivity license > 2000 points","No physical product",null,4060039111692]
[null,"Fire Monitoring System",null,"",{"$nulls":4},"",{"$nulls":4},"",""]
[null,"7050 003 14991","FSM-5000","F.01U.314.991","Fire Monitoring System 5000","5A",{"v":5329.44,"d":"5,329.44"},{"v":25070,"d":"25,070.00"},"n.a.","C","C",4911990000,"IT",{"v":0,"d":"0.000"},"0.001","Sold only in SEO. Outphased  for rest EMEA","No repair","Sold only in SEO. Outphased  for rest EMEA",8717332995257]
[null,"7050 003 14990","FSM-2500","F.01U.314.990","Fire Monitoring System 2500","5A",{"v":3613.19,"d":"3,613.19"},{"v":16996,"d":"16,996.00"},"n.a.","C","C",4911990000,"IT",0,"0.001","Sold only in SEO. Outphased  for rest EMEA","No repair","Sold only in SEO. Outphased  for rest EMEA",8717332995240]
[null,null,"FSM-10K","F.01U.374.278","Fire Monitoring System 10000","5A",{"v":9635.14,"d":"9,635.14"},{"v":45324,"d":"45,324.00"},"n.a.","C","C",4911990000,"IT","","0.001","Cannot be sold in SEO","No repair","Cannot be sold in SEO",4060039091192]
[null,null,"FSM-5000","F.01U.374.695","Fire Monitoring System 5000","5A",{"v":5329.44,"d":"5,329.44"},{"v":25070,"d":"25,070.00"},"n.a.","C","C",4911990000,"IT",{"v":0,"d":"0.000"},"0.001","Cannot be sold in SEO","No repair","Cannot be sold in SEO",4060039091437]
[null,null,"FSM-2500","F.01U.374.694","Fire Monitoring System 2500","5A",{"v":3613.19,"d":"3,613.19"},{"v":16996,"d":"16,996.00"},"n.a.","C","C",4911990000,"IT",{"v":0,"d":"0.000"},"0.001","Cannot be sold in SEO","No repair","Cannot be sold in SEO",4060039091420]
[null,"7050 003 14992","FSM-5000-EP","F.01U.314.992","Evolution pack FSM-5000","5A",520.06,{"v":2446,"d":"2,446.00"},"n.a.","C","C",4911990000,"IT",0,"0.001",null,"No repair",null,8717332995264]
[null,"7050 003 15067","FSM-2500-EP","F.01U.315.067","Evolution pack FSM-2500","5A",363.15,{"v":1708,"d":"1,708.00"},"n.a.","C","C",4911990000,"IT",0,"0.001",null,"No repair",null,8717332995288]
[null,"Conventional panels",null,"",{"$nulls":4},"",{"$nulls":4},"",""]
[null,705000164791,"FPC-500-2","F.01U.164.791","2 zone conventional fire panel","5A",{"v":397.2,"d":"397.20"},{"v":1868,"d":"1,868.00"},"5","C","A",8531103000,"CN",15,"2.2",{"$nulls":3},8717332759385]
[null,705000164792,"FPC-500-4","F.01U.164.792","4 zone conventional fire panel","5A",489.56,{"v":2303,"d":"2,303.00"},"5","C","A",8531103000,"CN",20,"3.456",{"$nulls":3},8717332759392]
[null,705000164793,"FPC-500-8","F.01U.164.793","8 zone conventional fire panel","5A",612.72,{"v":2882,"d":"2,882.00"},"5","C","A",8531103000,"CN",14,"3.42",{"$nulls":3},8717332759408]
[null,705000164794,"FPC-500-OCEXT","F.01U.164.794","Optional open collector board","5A",{"v":46.2,"d":"46.20"},{"v":217,"d":"217.00"},"5","C","A",8531900000,"CN",1,"0.1",{"$nulls":3},8717332759415]
[null,705000164795,"FPC-500-RLYEXT","F.01U.164.795","Optional relay board","5A",86.21,{"v":406,"d":"406.00"},"5","C","A",8531900000,"CN",10,"0.1",{"$nulls":3},8717332759422]
[null,705000164844,"FPC-500-KEY","F.01U.164.844","Optional access key level 2","5A",30.79,{"v":145,"d":"145.00"},"5","C","A",3926909790,"CN",8,"0.01",{"$nulls":3},8717332759859]
[null,"Batteries",null,"",{"$nulls":4},"","",null,null,""]
[null,"Batteries ",null,"",{"$nulls":4},"","",null,null,""]
[null,null,"IPS-BAT12V-12AH","F.01U.579.778","Battery 12 V / 10 - 12 Ah",null,0,0,"1",{"$nulls":5},"3.730"]
[null,null,"IPS-BAT12V-27AH","F.01U.579.781","Battery 12 V / 24 - 27 Ah",null,0,0,"1",{"$nulls":5},"7.96"]
[null,null,"IPS-BAT12V-45AH","F.01U.579.782","Battery 12 V / 38 - 45 Ah",null,0,0,"1",{"$nulls":5},"13.520"]
[null,"LSN Detectors",null,"",{"$nulls":4},"",{"$nulls":4},"",""]
[null,"500 Series",null,"",{"$nulls":4},"",{"$nulls":4},"",""]
[null,"6650 005 10149","FAP-O 520","F.01U.510.149","FAP-O 520 opt smoke detector LSNi white","5A",205.13,{"v":965,"d":"965.00"},"5","C","A",8531103000,"CN",112,"0.170",null,"SBN",null,8717332265121]
[null,"6650 005 10151","FAP-OC 520","F.01U.510.151","FAP-OC 520 Multisensor detector LSNi wh","5A",{"v":328.3,"d":"328.30"},{"v":1544,"d":"1,544.00"},"5","C","A",8531103000,"CN",23,"0.180",null,"SBN",null,8717332265138]
[null,"6650 005 10161","FAP-O 520-P","F.01U.510.161","FAP-O 520-P opt smoke detector LSNi tr","5A",{"v":232.5,"d":"232.50"},{"v":1094,"d":"1,094.00"},"5","C","A",8531103000,"CN",20,"0.170",null,"SBN",null,8717332265190]
[null,"6650 005 10162","FAP-OC 520-P","F.01U.510.162","FAP-OC 520-P Multisens detector LSNi tr","5A",335.28,{"v":1577,"d":"1,577.00"},"5","C","A",8531103000,"CN",15,"0.180",null,"SBN",null,8717332265213]
[null,"AVENAR detector 4000",null,"",{"$nulls":4},"",{"$nulls":4},"",""]
[null,"7050 003 07726","FAP-425-O-R","F.01U.307.726","Optical with Rotary-Switches","5A",90.75,{"$f":"ROUND(ROUND(G117*4.704*0.72,2),0)","v":{"v":307,"d":"307.00"}},"5","C","A",8531103000,"PT",12911,"0.077",null,"SBN",null,8717332972968]
[null,"7050 003 07728","FAP-425-OT-R","F.01U.307.728","Optical/Thermal with Rotary-Switches","5A",105.29,{"$f":"ROUND(ROUND(G118*4.704*0.72,2),0)","v":{"v":357,"d":"357.00"}},"5","C","A",8531103000,"PT",10961,"0.077",null,"SBN",null,8717332972982]
[null,"7050 003 07732","FAH-425-T-R","F.01U.307.732","Heat with Rotary-Switches","5A",82.68,{"$f":"ROUND(ROUND(G119*4.704*0.82,2),0)","v":{"v":319,"d":"319.00"}},"5","C","A",8531103000,"PT",1050,"0.077",null,"SBN",null,8717332973026]
[null,"7050 003 07729","FAP-425-DO-R","F.01U.307.729","Dual-Optical with Rotary-Switches","5A",98.08,{"$f":"ROUND(ROUND(G120*4.704*0.72,2),0)","v":{"v":332,"d":"332.00"}},"5","C","A",8531103000,"PT",2238,"0.077",null,"SBN",null,8717332972999]
[null,"7050 003 07730","FAP-425-DOT-R","F.01U.307.730","Dual-Optical/Thermal with Rotary-Switches","5A",113.58,{"$f":"ROUND(ROUND(G121*4.704*0.72,2),0)","v":{"v":385,"d":"385.00"}},"5","C","A",8531103000,"PT",2407,"0.077",null,"SBN",null,8717332973002]
[null,"7050 003 07731","FAP-425-DOTC-R","F.01U.307.731","Dual-Optical/Thermal/Chemical with Rotary-Switches","5A",{"v":189.8,"d":"189.80"},{"$f":"ROUND(ROUND(G122*4.704*0.75,2),0)","v":{"v":670,"d":"670.00"}},"5","C","A",8531103000,"PT",275,"0.082",null,"SBN",null,8717332973019]
[null,"7050 003 95473","FAP-425-DOTCO-R","F.01U.395.473","Detector dual-optical/thermal/CO","5A",{"v":189.8,"d":"189.80"},{"$f":"ROUND(ROUND(G123*4.704*0.75,2),0)","v":{"v":670,"d":"670.00"}},"5","C","A",8531103000,"PT",null,"0,082",null,"SBN",null,"4060039133199"]
[null,"7050 003 07725","FAP-425-O","F.01U.307.725","Optical without Rotary-Switches","5A",87.76,{"$f":"ROUND(ROUND(G124*4.704*0.72,2),0)","v":{"v":297,"d":"297.00"}},"5","C","A",8531103000,"PT",4365,"0.075",null,"SBN",null,8717332972951]
[null,"7050 003 07727","FAP-425-OT","F.01U.307.727","Optical/Thermal without Rotary-Switches","5A",103.11,{"$f":"ROUND(ROUND(G125*4.704*0.72,2),0)","v":{"v":349,"d":"349.00"}},"5","C","A",8531103000,"PT",1688,"0.075",null,"SBN",null,8717332972975]
[null,"Accessories 500/400/300 series detectors",{"$nulls":6},"",{"$nulls":4},"",""]
[null,"Accessories for FAP-500 Series",null,"",{"$nulls":4},"",{"$nulls":4},"",""]
[null,"6650 005 08713","FAA-500-CB","F.01U.508.713","FAA-500-CB, built-in housing for concrete ceiling","5A",73.66,{"v":347,"d":"347.00"},"5","C","B",3926909790,"DE",9,"0.2",null,"-",null,4060039033000]
[null,"6649 981 51297","FAA-500","4.998.151.297","FAA500, base LSN","5A",54.62,{"v":257,"d":"257.00"},"5","C","A",8536909599,"CN",174,"0.25",null,"SBN",null,8717332097494]
[null,"6649 981 51302","FAA-500-BB","4.998.151.302","FAA-500-BB, mount back box","5A",15.51,{"v":73,"d":"73.00"},"5","C","A",3926909790,"CN",192,"0.166",null,"SBN",null,8717332097487]
[null,"6649 981 51296","FAA-500-TR-P","4.998.151.296","FAA-500-TR-P, transperant iris with color insert","5A",{"v":24.5,"d":"24.50"},{"v":115,"d":"115.00"},"5","C","A",3926909790,"CN",20,"0.049",null,"SBN",null,8717332097562]
[null,"6649 981 51295","FAA-500-TR-W","4.998.151.295","Trim ring for 500 Series, iris white","5A",6.16,{"v":29,"d":"29.00"},"5","C","A",3926909790,"CN",151,"0.03",null,"SBN",null,8717332097555]
[null,"6650 005 10166","FAA-500-SB-H","F.01U.510.166","FAA-500-SB-H Surface mount back box with damp room seal ","5A",13.55,{"v":64,"d":"64.00"},"5","C","A",3926909790,"CN",38,"0.266",null,"SBN",null,"8717332204748"]
[null,"6650 005 10028","FAA-500-SPRING","F.01U.510.028","FAA-500-SPRING for concrete / wooden ceilings","5A",9.44,{"$f":"ROUND(ROUND(G134*4.704,2),0)","v":{"v":44,"d":"44.00"}},"5","C","A",7320208990,"CN",10,"0.116","Price per piece. Order only 10 pcs or multiple of 10. E.g. needed 30 pcs, order 30 pcs","-",null,"8717332204793"]
[null,"6649 981 51299","FAA-500-R","4.998.151.299","FAA-500-R base LSN with relay","5A",{"v":54.6,"d":"54.60"},{"v":257,"d":"257.00"},"5","C","A",8536909599,"CN",2,"0.24",null,"SBN",null,"8717332283224"]
[null,"Accessories for 300 and 400 series",null,"",{"$nulls":4},"",{"$nulls":4},"",""]
[null,"6650 005 08658","FAA-MSR420","F.01U.508.658","FAA-420-R Base with Relay for 420 Series","5A",43.37,{"v":204,"d":"204.00"},"5","C","A",8536909599,"CN",28,"0.09",null,"SBN",null,"8717332206896"]
[null,"6649 980 21535","MS 400","4.998.021.535","MS 400, socket, surface/ flush mounted cable supply","5A",5.56,{"$f":"ROUND(ROUND(G138*4.704*1.28,2),0)","v":{"v":33,"d":"33.00"}},"5","C",1,8536909599,"CN",3162,"0.009",null,"SBN",null,8717332019878]
[null,"7050 002 15139","MS 400 B","F.01U.215.139","MS 400 Detector Base with Bosch Logo","5A",5.21,{"$f":"ROUND(ROUND(G139*4.704*1.37,2),0)","v":{"v":34,"d":"34.00"}},"5","C","A",8536909599,"CN",11606,"0.09",null,"SBN",null,8717332019878]
[null,"7050 002 15142","FAA-420-SEAL","F.01U.215.142","FAA-420-SEAL Damp Room Seal MS400 (10ps)","5A",124.93,{"v":588,"d":"588.00"},"5","C","A",8536909599,"CN",38,"0.23","One package unit contains 10 pcs. E.g. 50 pcs needed --> order 5","SBN",null,8717332808830]
[null,"6649 981 13025","MSC 420","4.998.113.025","MSC 420 Add base surface-mount","5A",7.06,{"v":33,"d":"33.00"},"5","C","A",3926909790,"CN",944,"0.1",null,"-",null,8717332020461]
[null,"6649 981 14565","MSR 320","4.998.114.565","MSR 320 GLT, Base with Relay","5A",30.84,{"v":145,"d":"145.00"},"5","C",1,8536909599,"CN",254,"0.04",null,"SBN",null,8717332022519]
[null,"6649 980 25369","SK 400","4.998.025.369","SK 400, Metal cage for protection MagicSens detectors","5A",49.34,{"v":232,"d":"232.00"},"5","C","A",7326909890,"DE",39,"0.3",null,"SBN",null,8717332003266]
[null,"6649 980 35312","SSK400","4.998.035.312","SSK 400, dust cover (10ps)","5A",26.57,{"v":125,"d":"125.00"},"5","C","A",3926909790,"DE",123,"0.21","One package unit contains 10 pcs. E.g. 50 pcs needed --> order 5","SBN",null,8717332003310]
[null,"6649 980 84709","TP4 400","4.998.084.709","TP4 400, lettering strip till 4 m hight, (Attention!!! Order multiple, read comment)","5A",0.54,{"v":3,"d":"3.00"},"5","C","A",3926909790,"DE",4597,"0.006","Order only 50 pcs or multiple of 50. E.g. needed 150 pcs, order 150 pcs","-",null,8717332003396]
[null,"6649 980 84710","TP8 400","4.998.084.710","TP8 400, lettering strip till 8 m hight, (Attention!!! Order multiple, read comment)","5A",0.57,{"v":3,"d":"3.00"},"5","C","A",3926909790,"DE",879,"0.009","Order only 50 pcs or multiple of 50. E.g. needed 150 pcs, order 150 pcs","-",null,8717332003402]
[null,"6649 980 25373","MH 400","4.998.025.373","MH 400, detector heating","5A",{"v":49.6,"d":"49.60"},{"v":233,"d":"233.00"},"5","C","A",8531900000,"DE",15,"0.017",null,"-",null,8717332003280]
[null,"6649 980 97924","WA400","4.998.097.924","MK 400, detector console including socket","5A",44.06,{"v":207,"d":"207.00"},"5","C","A",3926909790,"DE",33,"0.199",null,"-",null,8717332003426]
[null,"7050 002 89620","FAA-420-RI-DIN","F.01U.289.620","Remote Indicator","5A",47.87,{"v":225,"d":"225.00"},"5","C",1,8531900000,"PT",175,"0.061",null,"SBN",null,8717332927982]
[null,"7050 002 89120","FAA-420-RI-ROW","F.01U.289.120","Remote Indicator","5A",15.94,{"v":75,"d":"75.00"},"5","C","A",8531900000,"PT",1155,"0.058",null,"SBN",null,8717332926756]
[null,"6627 992 71257","FMX-DET-MB","2.799.271.257","MOUNT BRACKfalse floor mounting bracket","5A",{"v":25.3,"d":"25.30"},{"v":119,"d":"119.00"},"5","C","A",3926909790,"DE",84,"0.09",null,"-",null,8717332018994]
[null,"7050 002 39554","FAA-420-CAP-V0","F.01U.239.554","Detector cap, V0 rating (200 pcs)","5A",434.19,{"v":2042,"d":"2,042.00"},"5","C","C","85369095","CN",0,"0.023","One unit contains 200 pcs. Minimum order quantity is 5 units (= 1.000 caps). Delivery time 3-4 months.","-","Mainly used for Israel",8717332822423]
[null,"7050 002 14891","MS 400 V0","F.01U.214.891","Detector base, V0 rating","5A",10.36,{"v":49,"d":"49.00"},"5","C","C","85369095","CN",0,"0.081",null,"-","Mainly used for Israel",8717332808199]
[null,"Conventional detectors",null,"",{"$nulls":4},"",{"$nulls":4},"",""]
[null,"320 Series",null,"",{"$nulls":4},"",{"$nulls":4},"",""]
[null,"7050 000 26293","FCP-O320","F.01U.026.293","FCP-O320 optical conventional (820Ω)","5A",40.92,{"v":192,"d":"192.00"},"5","C","A",8531103000,"CN",690,"0.072",null,"SBN",null,8717332253180]
[null,"7050 000 26292","FCP-OC320","F.01U.026.292","FCP-OC 320 optical/ chemical conv. det. (820Ω)","5A",180.16,{"v":847,"d":"847.00"},"5","C","A",8531103000,"CN",23,"0.1",null,"SBN",null,8717332253173]
[null,"7050 000 26295","FCP-OT320","F.01U.026.295","FCP-OT 320 optical/ heat conv. Detector (820Ω)","5A",70.49,{"v":332,"d":"332.00"},"5","C","A",8531103000,"CN",113,"0.09",null,"SBN",null,8717332253210]
[null,"7050 000 26291","FCH-T320","F.01U.026.291","FCH-T 320 conv. RoR heat detector (820Ω)","5A",31.28,{"v":147,"d":"147.00"},"5","C","A",8531103000,"CN",134,"0.069",null,"SBN",null,8717332253166]
[null,"7050 000 26294","FCH-T320-FSA","F.01U.026.294","FCH-T 320-FSA Heat, RoR conv. Detector (820Ω)","5A",61.24,{"v":288,"d":"288.00"},"5","C","A",8531103000,"CN",2,"0.09",null,"SBN",null,8717332253203]
[null,"7850 000 29857","FCP-O320-R470","F.01U.029.857","FCP-O 320-R470 optical smoke detector (470Ω)","5A",40.92,{"v":192,"d":"192.00"},"5","C","A",8531900000,"CN",31,"0.09",null,"SBN",null,800549091664]
[null,"7850 000 29867","FCP-OC320-R470","F.01U.029.867","FCP-OC 320-R470 Combined opt/gas det. (470Ω)","5A",180.16,{"v":847,"d":"847.00"},"5","C","A",8531103000,"CN",2,"0.09",null,"SBN",null,800549091718]
[null,"7850 000 29862","FCP-OT320-R470","F.01U.029.862","FCP-OT 320-R470 optical/heat detector (470Ω)","5A",70.49,{"v":332,"d":"332.00"},"5","C","A",8531103000,"CN",4,"0.091",null,"SBN",null,800549091701]
[null,"7850 000 29861","FCH-T320-R470","F.01U.029.861","FCH-T 320-R470 heat detector (470Ω)","5A",31.28,{"v":147,"d":"147.00"},"5","C","A",8531103000,"CN",4,"0.099",null,"SBN",null,800549091695]
[null,"7050 000 83619","FLM-320-EOL2W","F.01U.083.619","FLM-320-EOL2W Conv EOL Module 2-Wire","5A",34.22,{"v":161,"d":"161.00"},"5","C","A",8537109199,"CN",24,"0.03",null,"SBN",null,800549189309]
[null,705000083620,"FLM-320-EOL4W-S","F.01U.083.620","FLM-320-EOL4W-S Conv EOL Module 4-Wire","5A",150.52,{"v":708,"d":"708.00"},"5","C","A",8536501999,"CN",3,"0.48",null,"SBN",null,8717332361120]
[null,"500 Series",null,"",{"$nulls":4},"",{"$nulls":4},"",""]
[null,"7850 005 10647","FCA-500-EU","F.01U.510.647","FCA-500-EU base conventional for EU","5A",63.42,{"v":298,"d":"298.00"},"5","C","A",8536909599,"CN",40,"0.218",null,"SBN",null,8717332251490]
[null,"7850 005 10648","FCA-500-E-EU","F.01U.510.648","FCA-500-E-EU base conv-EOL for EU","5A",77.52,{"v":365,"d":"365.00"},"5","C","A",8536909599,"CN",7,"0.25",null,"SBN",null,8717332256228]
[null,"7850 005 12649","FCP-O 500","F.01U.510.649","FCP-O 500 conv opt smoke detector EU wh","5A",317.15,{"v":1492,"d":"1,492.00"},"5","C",1,8531103000,"CN",75,"0.308",null,"SBN",null,8717332251445]
[null,"7850 005 10653","FCP-OC 500","F.01U.510.653","FCP-OC 500 Multisens detect conv EU wh","5A",{"v":458.1,"d":"458.10"},{"v":2155,"d":"2,155.00"},"5","C","A",8531103000,"CN",10,"0.217",null,"SBN",null,8717332251469]
[null,"7850 005 10654","FCP-O 500-P","F.01U.510.654","FCP-O 500-P conv opt smoke det EU tr","5A",331.25,{"v":1558,"d":"1,558.00"},"5","C","A",8531103000,"CN",10,"0.36",null,"SBN",null,8717332251476]
[null,"7850 005 10656","FCP-OC 500-P","F.01U.510.656","FCP-OC 500-P conv multisen detect EU tr","5A",{"v":472.2,"d":"472.20"},{"v":2221,"d":"2,221.00"},"5","C","A",8531103000,"CN",1,"0.35",null,"SBN",null,8717332251483]
[null,"Detectors for explosive areas",null,"",{"$nulls":4},"",{"$nulls":4},"",""]
[null,"7050 002 79764","016519","F.01U.279.764","Flameproof (Exd) IR3 Flame Detector","5A",{"v":8788.34,"d":"8,788.34"},{"v":41340,"d":"41,340.00"},"3","C","A",8531103000,"GB",3,"2.5",null,"SBN",null,8717332906369]
[null,705000332582,"OOH740-A9-EX","F.01U.332.582","Dual-optical detector, explosive area","5A",{"v":569.4,"d":"569.40"},{"v":2678,"d":"2,678.00"},"3","C","A",85311030000,"CH",23,"0.124",null,"SBN",null,4260451081447]
[null,705000332583,"FDB201","F.01U.332.583","Base for Dual-Optical Detector for Ex Area","5A",34.16,{"v":161,"d":"161.00"},"3","C","A",85319085900,"CH",24,"0.025",null,"SBN",null,4260451081454]
[null,705000335165,"FDB291","F.01U.335.165","Base attachment","5A",25.31,{"v":119,"d":"119.00"},"3","C","A",85319000000,"CH",11,"0.036",null,"SBN",null,4260451089573]
[null,705000335589,"FDB295","F.01U.335.589","Base attachment wet","5A",97.43,{"v":458,"d":"458.00"},"3","C","A",85319000000,"CN",10,"0.286",null,"SBN",null,4060039000002]
[null,705000335595,"FDB295M","F.01U.335.595","Metal cable gland","5A",55.68,{"v":262,"d":"262.00"},"3","C","A",90269000900,"CH",27,"0.354","1 bag contains 10 pcs.20 pcs needed, order 2 pcs. (bags) REUP per unit (= 10 pcs)","SBN",null,4060039000064]
[null,705000335593,"FDUD291","F.01U.335.593","Detector exchanger","5A",{"v":2176.37,"d":"2,176.37"},{"v":10238,"d":"10,238.00"},"3","C","A",90318080000,"CH",0,"0.480",null,"SBN",null,4060039000040]
[null,705000335590,"FDBZ291","F.01U.335.590","Designation plate","5A",2.54,{"v":12,"d":"12.00"},"3","C","A",85319000000,"CH",13,"0.024","Order only 10 pcs or multiple of 10. E.g. needed 30 pcs, order 30 pcs","SBN",null,4060039000019]
[null,705000335591,"FDBZ293","F.01U.335.591","Detector locking device","5A",{"v":1,"d":"1.00"},{"v":5,"d":"5.00"},"3","C","A",85319000000,"CH",0,"0.026","Order only 100 pcs or multiple of 100. E.g. needed 60 pcs, order 100 pcs","SBN",null,4060039000026]
[null,705000335592,"FDBZ295","F.01U.335.592","Sealing element","5A",20.25,{"v":95,"d":"95.00"},"3","C","A",40169300900,"CH",3,"0.037",null,"SBN",null,4060039000033]
[null,705000335594,"FDZ291","F.01U.335.594","Detector dust cap","5A",3.79,{"v":18,"d":"18.00"},"3","C","A",85319000000,"CH",4,"0.045","Order only 10 pcs or multiple of 10. E.g. needed 30 pcs, order 30 pcs","SBN",null,4060039000057]
[null,"6649 981 15785","DOW1171-ident","4.998.115.785","DBZ1193A,  DOW1171 Det identifier","5A",1.93,{"v":9,"d":"9.00"},"3","C","A",8310000000,"CH",3,0,"Price per piece. Order only 10 pcs or multiple of 10. E.g. needed 30 pcs, order 30 pcs.","SBN",null,8717332020478]
[null,"Video-based Fire Detection",null,"",{"$nulls":4},"",{"$nulls":4},"",""]
["2026-01-01",null,"FVD-EDG-S","F.01U.434.719","Video fire detection server ","5C",{"v":4069.8,"d":"4,069.80"},{"v":19144,"d":"19,144.00"},"to follow","to follow","to follow",84715000,"DE","to follow","to follow",{"$nulls":3},4060039088093]
["2026-01-01",null,"FVD-EDG-1CH","F.01U.434.720","to follow","5C",{"v":3060,"d":"3,060.00"},{"v":14394,"d":"14,394.00"},"to follow","to follow","to follow",85235190,"DE","to follow","to follow",{"$nulls":3},4060039088413]
["2026-01-01",null,"FVD-EDG-2CH","F.01U.434.721","to follow","5C",{"v":6120,"d":"6,120.00"},{"v":28788,"d":"28,788.00"},"to follow","to follow","to follow",85235190,"DE","to follow","to follow",{"$nulls":3},4060039088420]
["2026-01-01",null,"FVD-EDG-3CH","F.01U.434.722","to follow","5C",{"v":9180,"d":"9,180.00"},{"v":43183,"d":"43,183.00"},"to follow","to follow","to follow",85235190,"DE","to follow","to follow",{"$nulls":3},4060039088437]
["2026-01-01",null,"FVD-EDG-4CH","F.01U.434.723","to follow","5C",{"v":12240,"d":"12,240.00"},{"v":57577,"d":"57,577.00"},"to follow","to follow","to follow",85235190,"DE","to follow","to follow",{"$nulls":3},4060039088444]
["2026-01-01",null,"XI231302","F.01U.434.724","Relay module","5C",{"v":275.4,"d":"275.40"},{"v":1295,"d":"1,295.00"},"to follow","to follow","to follow",85176200,"CN","to follow","to follow",{"$nulls":3},4060039088451]
["2026-01-01",null,"XI110208 ","F.01U.434.725","Input module, 8 inputs","5C",{"v":204,"d":"204.00"},{"v":960,"d":"960.00"},"to follow","to follow","to follow",85176200,"CN","to follow","to follow",{"$nulls":3},4060039088468]
["2026-01-01",null,"XACC-1-FAN-EXT","F.01U.436.968","to follow","5C",{"v":153,"d":"153.00"},{"v":720,"d":"720.00"},"to follow","to follow","to follow",84145100,"DE","to follow","to follow",{"$nulls":3},4060039148261]
["2026-01-01",null,"852-1813/000-001","F.01U.436.969","to follow","5C",{"v":2805,"d":"2,805.00"},{"v":13195,"d":"13,195.00"},"to follow","to follow","to follow",85444290,"DE","to follow","to follow",{"$nulls":3},4060039148278]
[null,"7050 004 06348","FCS-8000-VFD-I","F.01U.406.348","AI-VFD Bullet 4MP 4.4-10mm IP67","5A",{"v":7230.86,"d":"7,230.86"},{"v":34014,"d":"34,014.00"},"3","C","A",85258900,"PT",null,"3.285",null,"SBN",null,4060039159519]
[null,"7050  003 17536","FCS-8000-VFD-B","F.01U.317.536","AVIOTEC IP starlight 8000","5A",{"v":7230.86,"d":"7,230.86"},{"$f":"ROUND(ROUND(G198*4.704,2),0)","v":{"v":34014,"d":"34,014.00"}},"3","C","A",8525801931,"PT",44,"1.196",null,"SBN",null,8717332541010]
[null,"Wireless Devices",null,"",{"$nulls":4},"",{"$nulls":4},"",""]
[null,"66F01U349134","FWI-270","F.01U.349.134","Radio gateway","5A",{"v":1110.33,"d":"1,110.33"},{"v":5223,"d":"5,223.00"},"3","C","B",8517620000,"PT",11,"0.260",{"$nulls":3},4060039021670]
[null,"66F01U349135","FDOOT271-O","F.01U.349.135","Radio fire detector","5A",638.33,{"v":3003,"d":"3,003.00"},"3","C","B",8531900000,"CH",93,"0.134",{"$nulls":3},4060039021687]
[null,"66F01U349136","FDB271","F.01U.349.136","Base radio fire detector","5A",12.05,{"v":57,"d":"57.00"},"3","C","B",8536909599,"CH",92,"0.039",{"$nulls":3},4060039021694]
[null,"66F01U349137","FDMH273-R","F.01U.349.137","Radio manual call point housing","5A",138.51,{"v":652,"d":"652.00"},"3","C","B",8536501999,"CH",5,"0.285",{"$nulls":3},4060039021700]
[null,"66F01U349249","FDME273-O","F.01U.349.249","Radio manual call point switching unit","5A",800.92,{"v":3768,"d":"3,768.00"},"3","C","B",8536501999,"CH",6,"0.108",{"$nulls":3},4060039022233]
[null,"66F01U349248","BAT3.6-10","F.01U.349.248","Li-SOCl2 battery pack 3.6V, 10 Ah","5A",{"v":81.9,"d":"81.90"},{"v":385,"d":"385.00"},"1","C","B",8506501000,"CH",120,"0.09",{"$nulls":3},4060039022226]
[null,"66F01U349251","FDM275-O","F.01U.349.251","Radio manual call point","5A",827.42,{"v":3892,"d":"3,892.00"},"3","C","B",8536501999,"CH",1,"0.224",{"$nulls":3},4060039022257]
[null,"66F01U349250","DMZ1196-AC","F.01U.349.250","Spare glass FDM273-O","5A",11.21,{"v":53,"d":"53.00"},"3","C","B",3926909790,"CH",4,"0.117","Price of 1 Pc.\nBut can be only ordered in set of 10 Pieces ",null,null,4060039022240]
[null,"66F01U349252","FDMG295","F.01U.349.252","Spare glass FDM275-O","5A",13.49,{"v":63,"d":"63.00"},"3","C","B",926909790,"CH",1,"0.066","Price of 1 Pc.\nBut can be only ordered in set of 5 Pieces ",null,null,4060039022264]
[null,"66F01U349253","FDMP295","F.01U.349.253","Spare plastic FDM275-O","5A",20.24,{"v":95,"d":"95.00"},"3","C","B",3926909790,"CH",0,"0.04","Price of 1 Pc.\nBut can be only ordered in set of 5 Pieces ",null,null,4060039022271]
[null,"66F01U349254","FDUZ227","F.01U.349.254","MCL USB ADAPTER","5A",{"v":1324.84,"d":"1,324.84"},{"v":6232,"d":"6,232.00"},"3","C","B",8536909599,"CH",1,"0.197",{"$nulls":3},4060039022288]
[null,"Special detectors",null,"",{"$nulls":4},"",{"$nulls":4},"",""]
[null,"Titanus Smoke extraction systems Systems",{"$nulls":6},"",{"$nulls":4},"",""]
[null,"7050 000 78495","FAS-420-TM","F.01U.078.495","Smoke System","5A",{"v":1771.03,"d":"1,771.03"},{"v":8331,"d":"8,331.00"},"3","C","A",8536501999,"DE",11,"0.576",{"$nulls":3},8717332341863]
[null,"7050 000 78496","FAS-420-TM-R","F.01U.078.496","FAS-420-TM-R aspirating smoke detector","5A",{"v":2277.22,"d":"2,277.22"},{"v":10712,"d":"10,712.00"},"3","C","A",8536501999,"DE",1,"0.47",{"$nulls":3},8717332341870]
[null,"7050 000 78497","FAS-420-TM-RVB","F.01U.078.497","FAS-420-TM-RVB aspirating smoke detector","5A",{"v":2783.44,"d":"2,783.44"},{"v":13093,"d":"13,093.00"},"3","C","A",8536501999,"DE",1,"0.47",{"$nulls":3},8717332341887]
[null,"7050 000 78494 ","FAS-420-TM-HB","F.01U.078.494","FAS-420-TM series housing base","5A",201.95,{"v":950,"d":"950.00"},"3","C","A",8536909599,"DE",14,"0.468",{"$nulls":3},8717332341856]
[null,"6650 000 29252","FAS-420-TT1","F.01U.029.252","Titanus Top Sens TT1, LSNi","5A",{"v":5029.09,"d":"5,029.09"},{"v":23657,"d":"23,657.00"},"3","C","A",8536501999,"DE",4,"1.341",{"$nulls":3},8717332263530]
[null,"6650 000 29253","FAS-420-TT2","F.01U.029.253","Titanus Top Sens TT2, LSNi","5A",{"v":5029.09,"d":"5,029.09"},{"v":23657,"d":"23,657.00"},"3","C","A",8536501999,"DE",6,"1.45",{"$nulls":3},8717332263547]
[null,"6650 000 29255","FAS-420-TP1","F.01U.029.255","Titanus PRO SENS TP-1, LSNi","5A",{"v":2266.52,"d":"2,266.52"},{"v":10662,"d":"10,662.00"},"3","C",1,8536501999,"DE",32,"1.53",{"$nulls":3},8717332263554]
[null,"6650 000 29256","FAS-420-TP2","F.01U.029.256","Titanus PRO SENS TP-2, LSNi","5A",{"v":2266.52,"d":"2,266.52"},{"v":10662,"d":"10,662.00"},"3","C","A",8536501999,"DE",23,"1.45",{"$nulls":3},8717332263561]
[null,"7050 000 83877","FAS-420-TP1-SL","F.01U.083.877","Titanus Pro Sens Basic TP1 Silent","5A",{"v":2411.43,"d":"2,411.43"},{"v":11343,"d":"11,343.00"},"3","C","A",8536501999,"DE",5,"1.45",{"$nulls":3},8717332382514]
[null,"7050 000 83876","FAS-420-TP2-SL","F.01U.083.876","Titanus Pro Sens Basic TP2 Silent","5A",{"v":2411.43,"d":"2,411.43"},{"v":11343,"d":"11,343.00"},"3","C","A",8536501999,"DE",7,"1.55",{"$nulls":3},8717332382507]
[null,"7050 000 83875","FAS-420-TT1-SL","F.01U.083.875","Titanus Top Sens Basic TT1 Silent","5A",{"v":5526.98,"d":"5,526.98"},{"v":25999,"d":"25,999.00"},"3","C","C",8531900000,"DE",0,"1.45",{"$nulls":3},8717332382491]
[null,"7050 000 83874","FAS-420-TT2-SL","F.01U.083.874","Titanus Top Sens Basic TT2 Silent","5A",{"v":5526.98,"d":"5,526.98"},{"v":25999,"d":"25,999.00"},"3","C","A",8536501999,"DE",0,"1.57",{"$nulls":3},8717332382484]
[null,"7050 000 90252","FAS-ASD-SL","F.01U.090.252","Sound Suppressor for Aspirating","5A",252.66,{"v":1189,"d":"1,189.00"},"3","C","A",3926909790,"DE",6,"0.43",{"$nulls":3},8717332815821]
[null,"6649 981 43394","DM-TP-50(80)","4.998.143.394","Detector module DM-TP-50(80)-LB/a INCOMPATIBLE WITH FAS-420 TP/TT","5A",628.64,{"v":2957,"d":"2,957.00"},"3","C","A",8531900000,"DE",21,"0.11",null,null," INCOMPATIBLE WITH FAS-420 TP/TT",8717332036431]
[null,"6649 981 43395","DM-TP-10(25)","4.998.143.395","Detector module DM-TP-10(25)-LB/a INCOMPATIBLE WITH FAS-420 TP/TT","5A",{"v":1026.34,"d":"1,026.34"},{"v":4828,"d":"4,828.00"},"3","C","A",8531900000,"DE",10,"0.116",null,null," INCOMPATIBLE WITH FAS-420 TP/TT",8717332036448]
[null,"6649 981 43396","DM-TP-01(05)","4.998.143.396","Detector module DM-TP-01(05)-LB/a INCOMPATIBLE WITH FAS-420 TP/TT","5A",{"v":2754.02,"d":"2,754.02"},{"v":12955,"d":"12,955.00"},"3","C","A",8531900000,"DE",0,"0.1",null,null," INCOMPATIBLE WITH FAS-420 TP/TT",8717332036455]
[null,"6649 981 43400","DM-TT-50(80)","4.998.143.400","Detector module DM-TT-50(80)-LB/a","5A",632.92,{"v":2977,"d":"2,977.00"},"3","C","A",8531900000,"DE",46,"0.1",{"$nulls":3},8717332036486]
[null,"6649 981 43401","DM-TT-10(25)","4.998.143.401","Detector module DM-TT-10(25)-LB/a","5A",{"v":1026.34,"d":"1,026.34"},{"v":4828,"d":"4,828.00"},"3","C","A",8531900000,"DE",35,"0.14",{"$nulls":3},8717332036493]
[null,"6649 981 43402","DM-TT-01(05)","4.998.143.402","Detector module DM-TT-01(05)-LB/a","5A",{"v":2758.3,"d":"2,758.30"},{"v":12975,"d":"12,975.00"},"3","C","A",8531900000,"DE",18,"0.125",{"$nulls":3},8717332036509]
[null,"Conventional smoke extraction systems ",{"$nulls":6},"",{"$nulls":4},"",""]
[null,"7050 001 41195","FCS-320-TM","F.01U.141.195","FCS-320-TM Conventional ASD","5A",{"v":1600.97,"d":"1,600.97"},{"v":7531,"d":"7,531.00"},"3","C","A",8536501999,"DE",2,"0.53",{"$nulls":3},8717332485130]
[null,"7051 001 41196","FCS-320-TM-R","F.01U.141.196","FCS-320-TM-R Conventional ASD","5A",{"v":2107.18,"d":"2,107.18"},{"v":9912,"d":"9,912.00"},"3","C","C",8536501999,"DE",0,"0.47",{"$nulls":3},8717332485147]
[null,"7052 001 41197","FCS-320-TP1","F.01U.141.197","FCS-320-TP1 Conventional ASD","5A",{"v":2095.21,"d":"2,095.21"},{"v":9856,"d":"9,856.00"},"3","C","A",8536501999,"DE",6,"1.282",{"$nulls":3},8717332485154]
[null,"7053 001 41198","FCS-320-TP2","F.01U.141.198","FCS-320-TP2 Conventional ASD","5A",{"v":2095.21,"d":"2,095.21"},{"v":9856,"d":"9,856.00"},"3","C","A",8536501999,"DE",8,"1.324",{"$nulls":3},8717332485161]
[null,"7050 001 41199","FCA-320-RESET","F.01U.141.199","Reset Board for FCS-320 series","5A",200.62,{"v":944,"d":"944.00"},"3","C","A",8531900000,"DE",0,"0.02",{"$nulls":3},8717332485178]
[null,"7050 001 41200","FCA-320-RELAY","F.01U.141.200","Relay Module Type RU-1 for FCS-320-TM-R","5A",377.32,{"v":1775,"d":"1,775.00"},"3","C","C",8536490099,"DE",0,"0.1",{"$nulls":3},8717332485185]
[null,"7054 001 41201","FCS-320-IK","F.01U.141.201","Installation Kid for add. modules","5A",46.51,{"v":219,"d":"219.00"},"3","C","C",7326909890,"DE",0,"0.033",{"$nulls":3},8717332485192]
[null,"Titanus Accessories and reduction foils ",{"$nulls":6},"",{"$nulls":4},"",""]
[null,"6649 981 43410","TITANUS MT-1 mount","4.998.143.410","Fixing unit MT-1","5A",120.97,{"v":569,"d":"569.00"},"3","C","A",7326909890,"DE",2,"0.971",null,"-",null,8717332036516]
[null,"6649 981 43413","TITANUS AF-BR","4.998.143.413","fixing foil","5A",2.16,{"v":10,"d":"10.00"},"3","C","A",3926909790,"DE",750,"0.001","Order only 10 pcs or multiple of 10. E.g. needed 30 pcs, order 30 pcs. Price per piece","-",null,8717332036530]
[null,"6649 981 43416","TITANUS AF-2.0","4.998.143.416","reduction foil 2,0mm","5A",2.16,{"v":10,"d":"10.00"},"3","C","A",3926909790,"DE",154,"0.017","Order only 10 pcs or multiple of 10. E.g. needed 30 pcs, order 30 pcs. Price per piece","-",null,8717332036547]
[null,"6649 981 43417","TITANUS AF-2.5","4.998.143.417","reduction foil 2,5mm","5A",2.16,{"v":10,"d":"10.00"},"3","C","A",3926909790,"DE",150,"0.009","Order only 10 pcs or multiple of 10. E.g. needed 30 pcs, order 30 pcs. Price per piece","-",null,8717332036554]
[null,"6649 981 43418","TITANUS AF-3.0","4.998.143.418","reduction foil 3,0mm","5A",2.16,{"v":10,"d":"10.00"},"3","C","A",3926909790,"DE",136,"0.001","Order only 10 pcs or multiple of 10. E.g. needed 30 pcs, order 30 pcs. Price per piece","-",null,8717332036561]
[null,"6649 981 43419","TITANUS AF-3.2","4.998.143.419","reduction foil 3,2mm","5A",2.16,{"v":10,"d":"10.00"},"3","C","A",3926909790,"DE",125,"0.012","Order only 10 pcs or multiple of 10. E.g. needed 30 pcs, order 30 pcs. Price per piece","-",null,8717332036578]
[null,"6649 981 43420","TITANUS AF-3.4","4.998.143.420","reduction foil 3,4mm","5A",2.16,{"v":10,"d":"10.00"},"3","C","A",3926909790,"DE",122,"0.116","Order only 10 pcs or multiple of 10. E.g. needed 30 pcs, order 30 pcs. Price per piece","-",null,8717332036585]
[null,"6649 981 43422","TITANUS AF-3.6","4.998.143.422","reduction foil 3,6mm","5A",2.16,{"v":10,"d":"10.00"},"3","C","A",3926909790,"DE",132,"0.001","Order only 10 pcs or multiple of 10. E.g. needed 30 pcs, order 30 pcs. Price per piece","-",null,8717332036592]
[null,"6649 981 43423","TITANUS AF-3.8","4.998.143.423","reduction foil 3,8mm","5A",2.16,{"v":10,"d":"10.00"},"3","C","A",3926909790,"DE",95,"0.366","Order only 10 pcs or multiple of 10. E.g. needed 30 pcs, order 30 pcs. Price per piece","-",null,8717332036608]
[null,"6649 981 43424","TITANUS AF-4.0","4.998.143.424","reduction foil 4,0mm","5A",2.16,{"v":10,"d":"10.00"},"3","C","A",3926909790,"DE",126,"0.017","Order only 10 pcs or multiple of 10. E.g. needed 30 pcs, order 30 pcs. Price per piece","-",null,8717332036615]
[null,"6649 981 43425","TITANUS AF-4.2","4.998.143.425","reduction foil 4,2mm","5A",2.16,{"v":10,"d":"10.00"},"3","C","A",3926909790,"DE",50,"0.017","Order only 10 pcs or multiple of 10. E.g. needed 30 pcs, order 30 pcs. Price per piece","-",null,8717332036622]
[null,"6649 981 43426","TITANUS AF-4.4","4.998.143.426","reduction foil 4,4mm","5A",2.16,{"v":10,"d":"10.00"},"3","C","A",3926909790,"DE",52,"0.017","Order only 10 pcs or multiple of 10. E.g. needed 30 pcs, order 30 pcs. Price per piece","-",null,8717332036639]
[null,"6649 981 43427","TITANUS AF-4.6","4.998.143.427","reduction foil 4,6mm","5A",2.16,{"v":10,"d":"10.00"},"3","C","A",3926909790,"DE",37,"0.017","Order only 10 pcs or multiple of 10. E.g. needed 30 pcs, order 30 pcs. Price per piece","-",null,8717332036646]
[null,"6649 981 43428","TITANUS AF-5.0","4.998.143.428","reduction foil 5,0mm","5A",2.16,{"v":10,"d":"10.00"},"3","C","A",3926909790,"DE",53,"0.042","Order only 10 pcs or multiple of 10. E.g. needed 30 pcs, order 30 pcs. Price per piece","-",null,8717332036653]
[null,"6649 981 43429","TITANUS AF-5.2","4.998.143.429","reduction foil 5,2mm","5A",2.16,{"v":10,"d":"10.00"},"3","C","A",3926909790,"DE",30,"0.008","Order only 10 pcs or multiple of 10. E.g. needed 30 pcs, order 30 pcs. Price per piece","-",null,8717332036660]
[null,"6649 981 43430","TITANUS AF-5.6","4.998.143.430","reduction foil 5,6mm","5A",2.16,{"v":10,"d":"10.00"},"3","C","A",3926909790,"DE",45,"0.003","Order only 10 pcs or multiple of 10. E.g. needed 30 pcs, order 30 pcs. Price per piece","-",null,8717332036677]
[null,"6649 981 43431","TITANUS AF-6.0","4.998.143.431","reduction foil 6,0mm","5A",2.16,{"v":10,"d":"10.00"},"3","C","A",3926909790,"DE",53,"0.017","Order only 10 pcs or multiple of 10. E.g. needed 30 pcs, order 30 pcs. Price per piece","-",null,8717332036684]
[null,"6649 981 43432","TITANUS AF-6.8","4.998.143.432","reduction foil 6,8mm","5A",2.16,{"v":10,"d":"10.00"},"3","C","A",3926909790,"DE",35,"0.017","Order only 10 pcs or multiple of 10. E.g. needed 30 pcs, order 30 pcs. Price per piece","-",null,8717332036691]
[null,"6649 981 43433","TITANUS AF-7.0","4.998.143.433","reduction foil 7,0mm","5A",2.16,{"v":10,"d":"10.00"},"3","C","A",3926909790,"DE",51,"0.017","Order only 10 pcs or multiple of 10. E.g. needed 30 pcs, order 30 pcs. Price per piece","-",null,8717332036707]
[null,"6649 981 48848","RAS test-pipe","4.998.148.848","Test tube","5A",{"v":71.7,"d":"71.70"},{"v":337,"d":"337.00"},"3","C","A",8531900000,"DE",4,"0.12",null,"-",null,8717332036714]
[null,"6649 981 48849","RAS test adapter","4.998.148.849","Test adapter","5A",44.81,{"v":211,"d":"211.00"},"3","C","A",3917400099,"DE",8,"0.116",null,"-",null,8717332036721]
[null,"6650 000 33505","FAS-ASD-DIAG","F.01U.033.505","Diagnostic cable incl. software DIAG 3","5A",963.18,{"$f":"ROUND(ROUND(G262*4.704,2),0)","v":{"v":4531,"d":"4,531.00"}},"3","C","A",8523491000,"DE",2,"0.6",{"$nulls":3},8717332289066]
[null,"Accessories for Titanus ",null,"",{"$nulls":4},"",{"$nulls":4},"",""]
[null,"6650 000 29727","FAS-ASD-AHC","F.01U.029.727","Aspiration hose for ceiling let through","5A",675.06,{"v":3175,"d":"3,175.00"},"3","C","A",3917320099,"DE",3,"1.98",{"$nulls":3},8717332264858]
[null,"6650 000 29725","FAS-ASD-CLT","F.01U.029.725","Ceiling let through","5A",22.96,{"v":108,"d":"108.00"},"3","C","A",3917400099,"DE",42,"0.009","Delivered in packages of 10 pcs. If 30 pcs needed, order 30 pcs. BLP is per piece.",null,null,8717332264834]
[null,"6650 000 29724","FAS-ASD-AR","F.01U.029.724","Aspiration Reduction","5A",8.35,{"v":39,"d":"39.00"},"3","C","A",3926909790,"DE",0,"0.01",{"$nulls":3},8717332264827]
[null,"6650 000 29722","FAS-ASD-F","F.01U.029.722","Flange","5A",59.16,{"v":278,"d":"278.00"},"3","C","A",3926909790,"DE",9,"0.333",{"$nulls":3},8717332264803]
[null,"6650 000 29721","FAS-ASD-TRPG16","F.01U.029.721","Threaded ring, PG 16","5A",9.75,{"v":46,"d":"46.00"},"3","C","A",3917400099,"DE",60,"0.09",{"$nulls":3},8717332264797]
[null,"6650 000 29720","FAS-ASD-CSL","F.01U.029.720","Connection straight line","5A",8.35,{"v":39,"d":"39.00"},"3","C","A",3917400099,"DE",157,"0.017",{"$nulls":3},8717332264780]
[null,"6650 000 29719","FAS-ASD-PHF16","F.01U.029.719","Polywell hose flexible, PG 16","5A",521.95,{"v":2455,"d":"2,455.00"},"3","C","A",3917320099,"DE",1,"2.42",{"$nulls":3},8717332264773]
[null,"6650 000 29718","FAS-ASD-3WT","F.01U.029.718","Three way tap","5A",243.59,{"v":1146,"d":"1,146.00"},"3","C","A",8481808190,"DE",29,"0.306",{"$nulls":3},8717332264766]
[null,"6650 000 29717","FAS-ASD-WS","F.01U.029.717","Water Separator","5A",626.34,{"v":2946,"d":"2,946.00"},"3","C","A",8421210090,"DE",2,"1.324",{"$nulls":3},8717332264759]
[null,"6650 000 29716","FAS-ASD-DSB","F.01U.029.716","Detonation Safety barrier","5A",{"v":2505.36,"d":"2,505.36"},{"v":11785,"d":"11,785.00"},"3","C","A",7326909890,"DE",0,"1.341",{"$nulls":3},8717332264742]
[null,"6650 000 29715","FAS-ASD-RFL","F.01U.029.715","Replacement Filter Large","5A",{"v":50.1,"d":"50.10"},{"v":236,"d":"236.00"},"3","C","A",84219900,"DE",97,"0.018",{"$nulls":3},8717332264735]
[null,"6650 000 29714","FAS-ASD-FL","F.01U.029.714","Filterbox Large","5A",250.54,{"v":1179,"d":"1,179.00"},"3","C","A",8421999099,"DE",56,"0.43",{"$nulls":3},8717332264728]
[null,"Fireray Linear Smoke Detectors",null,"",{"$nulls":4},"",{"$nulls":4},"",""]
[null,"7050 002 90195","FIRERAY3000","F.01U.290.195","Fireray 3000 End-To-End Linear Beam","5A",{"v":3112.38,"d":"3,112.38"},{"v":14641,"d":"14,641.00"},"3","C","A",8536501999,"GB",7,"1.62",null,null,"Successor of Fireray 2000",8717332929009]
[null,"7050 004 00533","FRAY-ONE-EN","F.01U.400.533","Linear Beam, standalone reflective","5A",{"v":1504.64,"d":"1,504.64"},{"v":7078,"d":"7,078.00"},"3","C","A","85365019","GB",15,"0.800",null,null,"Successor of FR50/100",4060039150370]
[null,"7050 002 90196","FIRERAY3000-HD","F.01U.290.196","Fireray 3000 additional Head","5A",{"v":2688.99,"d":"2,688.99"},{"v":12649,"d":"12,649.00"},"3","C","A",8536501999,"GB",2,"0.65",{"$nulls":3},8717332929016]
[null,"7050 002 90197","FIRERAY5000-EN","F.01U.290.197","Fireray 5000 Refl. linear beam detector","5A",{"v":2500,"d":"2,500.00"},{"v":11760,"d":"11,760.00"},"3","C","A",8536501999,"GB",10,"2.106",null,null,"Successor of FRAY 5000 Types",8717332929023]
[null,"7050 001 43257","FRAY5000-HEAD-EN","F.01U.143.247","Additional head for FRAY5000-EN","5A",{"v":1448.4,"d":"1,448.40"},{"v":6813,"d":"6,813.00"},"3","C","A",8531900000,"GB",7,"0.666",{"$nulls":3},8717332493821]
[null,705000083264,"FRAY5000-LR-KIT","F.01U.083.264","Fireray5000 long range kit 50m extension","5A",404.81,{"v":1904,"d":"1,904.00"},"3","C","A",8536501999,"GB",18,"0.18",{"$nulls":3},8717332359769]
[null,"7050 000 98240","FRAY5000-BR","F.01U.098.240","Universal Bracket Accessory for Fray5000","5A",405.73,{"v":1909,"d":"1,909.00"},"3","C","A",7326909890,"US",14,"0.199",{"$nulls":3},8717332390779]
[null,"7050 000 98241","FRAY5000-4PRISM","F.01U.098.241","Prism Plate for  4 prism","5A",256.82,{"v":1208,"d":"1,208.00"},"3","C","A",7326909890,"US",7,"0.383",{"$nulls":3},8717332390786]
[null,"7050 000 98242","FRAY5000-1PRISM","F.01U.098.242","Prism Plate for 1 Prism","5A",224.72,{"v":1057,"d":"1,057.00"},"3","C","A",7326909890,"US",6,"0.09",{"$nulls":3},8717332390793]
[null,"Heat detectors",null,"",{"$nulls":4},"",{"$nulls":4},"",""]
[null,"7050 003 32846","FCS-LHD-2EN","F.01U.393.476","Linear heat detector, VdS","5A",{"v":3305.74,"d":"3,305.74"},{"v":15550,"d":"15,550.00"},"3","C","A",8536501990,"GB",null,"0.950",{"$nulls":3},4060039128997]
[null,"7050 003 95474","FCS-LHDSC-EN100","F.01U.395.474","Sensor cable PVC, VdS, 100m","5A",{"v":1567.12,"d":"1,567.12"},{"v":7372,"d":"7,372.00"},"3","C","A",85444993,"GB",1,"2.470","Sensor cable on reel 100m",null,null,4060039133205]
[null,"7051 003 95475","FCS-LHDSC-EN250","F.01U.395.475","Sensor cable PVC, VdS, 250m","5A",{"v":3920.5,"d":"3,920.50"},{"v":18442,"d":"18,442.00"},"3","C","A",85444993,"GB",1,"6.180","Sensor cable on reel 250m",null,null,4060039133212]
[null,"7052 003 95476","FCS-LHDSC-EN500","F.01U.395.476","Sensor cable PVC, VdS, 500m","5A",{"v":7810.65,"d":"7,810.65"},{"v":36741,"d":"36,741.00"},"3","C","A",85444993,"GB",2,"12.350","Sensor cable on reel 500m",null,null,4060039133229]
[null,"7050 004 03515","FCS-LHDSC-NYL100","F.01U.403.515","Sensor cable nylon, VdS, 100m","5A",{"v":1971.37,"d":"1,971.37"},{"v":9273,"d":"9,273.00"},"3","C","A",85444993,"GB",0,"3.510","Sensor cable on reel 100m",null,null,4060039154903]
[null,"7051 004 03516","FCS-LHDSC-NYL250","F.01U.403.516","Sensor cable nylon, VdS, 250m","5A",{"v":4866.05,"d":"4,866.05"},{"v":22890,"d":"22,890.00"},"3","C","A",85444993,"GB",0,"8.780","Sensor cable on reel 250m",null,null,4060039154910]
[null,"7052 004 03517","FCS-LHDSC-NYL500","F.01U.403.517","Sensor cable nylon, VdS, 500m","5A",{"v":9482.57,"d":"9,482.57"},{"v":44606,"d":"44,606.00"},"3","C","A",85444993,"GB",0,"17.550","Sensor cable on reel 500m",null,null,4060039154927]
[null,"7053 004 03518","FCS-LHDSC-STL100","F.01U.403.518","Sensor cable steel, VdS, 100m","5A",{"v":3156.7,"d":"3,156.70"},{"v":14849,"d":"14,849.00"},"3","C","A",85444993,"GB",0,"3.770","Sensor cable on reel 100m",null,null,4060039154934]
[null,"7054 004 03519","FCS-LHDSC-STL250","F.01U.403.519","Sensor cable steel, VdS, 250m","5A",{"v":7720.2,"d":"7,720.20"},{"v":36316,"d":"36,316.00"},"3","C","A",85444993,"GB",0,"9.430","Sensor cable on reel 250m",null,null,4060039154941]
[null,"7055 004 03520","FCS-LHDSC-STL500","F.01U.403.520","Sensor cable steel, VdS, 500m","5A",{"v":15097.28,"d":"15,097.28"},{"v":71018,"d":"71,018.00"},"3","C","A",85444993,"GB",0,"18.850","Sensor cable on reel 500m",null,null,4060039154958]
[null,"7050 003 95477","FCS-LHD2EN-EOL","F.01U.395.477","End-of-line module, VdS","5A",417.23,{"v":1963,"d":"1,963.00"},"3","C","A",85319000,"GB",0,"0.112",{"$nulls":3},4060039133236]
[null,"7051 003 95478","FCS-LHD2EN-CONN","F.01U.395.478","Connection module, VdS","5A",320.94,{"v":1510,"d":"1,510.00"},"3","C","A",85319000,"GB",1,"0.211",{"$nulls":3},4060039133243]
[null,"7050 003 95480","FCS-LHD2EN-CLIP","F.01U.395.480","L-Clip, 50mm","5A",306.19,{"v":1440,"d":"1,440.00"},"3","C","A",73261990,"GB",0,"0.040","One unit contains 100 pcs. When 200 clips needed, order 2 units",null,null,4060039133267]
[null,"7050 003 95479","FCS-LHD2EN-SLE","F.01U.395.479","Silicone sleeves","5A",80.23,{"v":377,"d":"377.00"},"3","C","A",39259010,"GB",0,"1.590",{"$nulls":3},4060039133250]
[null,"Duct detector",null,"",{"$nulls":4},"",{"$nulls":4},"",""]
[null,"7850 000 29411","FAD-420-HS-EN","F.01U.029.411","Air sampling housing with MS400 base","5A",218.95,{"v":1030,"d":"1,030.00"},"5","C","A",8536909599,"CN",125,"1.944",{"$nulls":3},8717332264193]
[null,"7050 003 08231","FAD-425-O-R","F.01U.308.231","Detector for use in air sampling housing","5A",109.55,{"v":515,"d":"515.00"},"5","C","A",8531103000,"PT",136,"0.077",null,"SBN",null,8717332974498]
[null,"6650 000 29219","D344-1.5","F.01U.029.219","DUCT SAMPLE TUBE 1.5 FEET","5A",22.58,{"v":106,"d":"106.00"},"3","C","A",7608208990,"CN",11,"0.058",{"$nulls":3},8717332288274]
[null,"6650 000 29175","D344-3","F.01U.029.175","DUCT SAMPLE TUBE 3 FOOT","5A",43.84,{"v":206,"d":"206.00"},"3","C","A",7608208990,"CN",31,"0.116",{"$nulls":3},8717332288458]
[null,"6650 000 29174","D344-5","F.01U.029.174","SAMPLE TUBE 5FT (DS290)","5A",73.07,{"v":344,"d":"344.00"},"3","C","A",7608208990,"CN",31,"0.21",{"$nulls":3},8717332288465]
[null,"1826 950 89828","D344-TF","F.01U.425.789","DUCT TUBE FILTERS 20/PK","5A",135.25,{"v":636,"d":"636.00"},"3","C","A",8421999099,"CN",2,"0.14",{"$nulls":3},782695089828]
[null,"7850 000 29619","FAD-RB-DIBT","F.01U.029.619","Relay board for DIBT application","5A",{"v":47.9,"d":"47.90"},{"v":225,"d":"225.00"},"3","C","A",85371099,"CN",4,"0.018",{"$nulls":3},800549091183]
[null,"Infrared flame detector",null,"",{"$nulls":4},"",{"$nulls":4},"",""]
[null,null,"922819","F.01U.418.818","IR flame detector FMX5000 IR VK","5A",{"v":6339.94,"d":"6,339.94"},{"v":29823,"d":"29,823.00"},"3","C","C",85365019,"DE",null,"0.590","For operation of the detector order also:  929144, 924441, optional: 904757",null,null,4060039188960]
[null,null,924420,"F.01U.418.819","IR-flame detector FMX5000 IR 3GD","5A",{"v":7857.18,"d":"7,857.18"},{"v":36960,"d":"36,960.00"},"3","C","C","90318080","DE",2,"0.590","For operation of the detector order also 926826, 924442, optional:  904757",null,null,4060039188977]
[null,null,926826,"F.01U.418.822","Relay module KMX5000 RK 3GD VK","5A",650.25,{"v":3059,"d":"3,059.00"},"3","C","C","85319085","DE",2,"0.050",{"$nulls":3},4060039189004]
[null,null,929144,"F.01U.418.821","Relay module KMX5000 RK VK","5A",484.35,{"v":2278,"d":"2,278.00"},"3","C","C",85319000,"DE",null,"0.050",{"$nulls":3},4060039188991]
[null,null,924441,"F.01U.418.824","Socket MX5000 VK","5A",327.83,{"v":1542,"d":"1,542.00"},"3","C","C",85389099,"DE",null,"0.380",{"$nulls":3},4060039189028]
[null,null,904757,"F.01U.418.826","Bracket MX5000","5A",51.36,{"v":242,"d":"242.00"},"3","C","C",85389099,"DE",null,"0.095",{"$nulls":3},4060039189042]
[null,null,911674,"F.01U.418.820","IR-flame detector FMX5000 IR Ex","5A",{"v":9211.88,"d":"9,211.88"},{"v":43333,"d":"43,333.00"},"3","C","C","90318080","DE",null,"0.590","Order together with: 922689 and 924442. Order optional 904757",null,null,4060039188984]
[null,null,922689,"F.01U.418.823","Safety barrier Ex isol. 24V 2 channel","5A",{"v":2032.03,"d":"2,032.03"},{"v":9559,"d":"9,559.00"},"3","C","C","85363010","DE",null,"0.150",{"$nulls":3},4060039189011]
[null,null,924442,"F.01U.418.825","Socket MX5000 Ex VK","5A",596.07,{"v":2804,"d":"2,804.00"},"3","C","C","85389099","DE",null,"0.530",{"$nulls":3},4060039189035]
[null,"7050 002 79762","016589","F.01U.279.762","IR3 Flame Detector","5A",{"v":7044.38,"d":"7,044.38"},{"v":33137,"d":"33,137.00"},"3","C","A",8536501999,"GB",6,"2.0",null,"SBN",null,8717332906345]
[null,"7050 002 79880","007127","F.01U.279.880","Mounting Bracket Flame Detector","5A",{"v":417.3,"d":"417.30"},{"v":1963,"d":"1,963.00"},"3","C","A",8536501999,"GB",9,"0.655",null,"SBN",null,8717332906376]
[null,"Addressable manual call points",null,"",{"$nulls":4},"",{"$nulls":4},"",""]
[null,"6650 000 11956","FMC-210-DM-G-R","F.01U.011.956","FMC-210-DM-G-R MCP LSN indoor red","5A",62.03,{"v":292,"d":"292.00"},"3","C",1,8536501999,"CN",992,"0.237",null,"SBN",null,8717332250127]
[null,"6650 000 11958","FMC-210-DM-H-R","F.01U.011.958","FMC-210-DM-H-R MCP LSN outdoor red","5A",155.04,{"v":729,"d":"729.00"},"3","C",1,8536501999,"CN",62,"0.244",null,"SBN",null,8717332250134]
[null,"6650 000 11959","FMC-210-DM-G-B","F.01U.011.959","FMC-210-DM-G-B MCP LSN Indoor blue","5A",62.03,{"v":292,"d":"292.00"},"3","C",1,8536501999,"CN",222,"0.252",null,"SBN",null,8717332250141]
[null,"6650 000 11960","FMC-210-DM-H-B","F.01U.011.960","FMC-210-DM-H-B MCP LSN outdoor blue","5A",155.04,{"v":729,"d":"729.00"},"3","C","A",8531900000,"CN",7,"0.249",null,"SBN",null,8717332250158]
[null,"6650 000 11961","FMC-210-DM-G-Y","F.01U.011.961","FMC-210-DM-G-Y MCP LSN indoor yellow","5A",62.03,{"$f":"ROUND(ROUND(G326*4.704,2),0)","v":{"v":292,"d":"292.00"}},"3","C","A",8531900000,"CN",28,"0.241",null,"SBN",null,8717332250165]
[null,"6650 000 11962","FMC-210-SM-G-R","F.01U.011.962","FMC-210-SM-G-R single action indoor red","5A",64.65,{"v":304,"d":"304.00"},"3","C","A",8536501999,"CN",20,"0.236",{"$nulls":3},8717332250172]
[null,"7850 000 27317","FMC-210-SM-G-B","F.01U.027.317","FMC-210-SM-G-B single action indoor blue","5A",64.65,{"v":304,"d":"304.00"},"3","C","A",8536501999,"CN",4,"0.249",{"$nulls":3},8717332256686]
[null,"7050 003 28502 ","FMC-210-DM-G-GR","F.01U.328.502","FMC-210-DM-G-GR MCP LSN Indoor green","5A",62.03,{"v":292,"d":"292.00"},"3","C",1,8536501999,"CN",15,"0.249",null,"SBN",null,8717332951499]
[null,"6650 000 12781","FMC-420RW-GSGRD","F.01U.012.781","MCP_LSNi_INDOOR_SURFACE_GLASS_RED","5A",72.74,{"v":342,"d":"342.00"},"3","C","A",8536501999,"CN",64,"0.835",{"$nulls":3},8717332259236]
[null,"6650 000 12782","FMC-420RW-GSRRD","F.01U.012.782","MCP_LSNi_INDOOR_SURFMT_RESET_RED","5A",72.74,{"v":342,"d":"342.00"},"3","C",1,8536501999,"CN",497,"0.183",{"$nulls":3},8717332259243]
[null,"6650 000 12783","FMC-420RW-GFGRD","F.01U.012.783","MCP_LSNi_INDOOR_FLUSHMOUNT_GLASS_RED","5A",72.74,{"v":342,"d":"342.00"},"3","C","A",8536501999,"CN",3,"0.183",{"$nulls":3},8717332259250]
[null,"6650 000 12784","FMC-420RW-GFRRD","F.01U.012.784","MCP_LSNi_INDOOR_FLUSHMOUNT_RESET_RED","5A",72.74,{"v":342,"d":"342.00"},"3","C","A",8536501999,"CN",28,"0.17",{"$nulls":3},8717332259267]
[null,"6650 000 12707","FMC-420RW-GSGBU","F.01U.012.707","MCP_LSNi_INDOOR_SURFMT_GLASS_BLUE","5A",72.74,{"v":342,"d":"342.00"},"3","C","C",8536501999,"CN",0,"0.241",{"$nulls":3},"8717332259199"]
[null,"6650 000 12708","FMC-420RW-GSRBU","F.01U.012.708","MCP_LSNi_INDOOR_SURFMT_RESET_BLUE","5A",72.74,{"v":342,"d":"342.00"},"3","C","A",8536501999,"CN",12,"0.835",{"$nulls":3},"8717332259205"]
[null,"6650 000 12787","FMC-420RW-GSGYE","F.01U.012.787","MCP_LSNi_INDOOR_SURFMT_GLASS_YEL","5A",72.74,{"v":342,"d":"342.00"},"3","C","C",8536501999,"CN",0,"0.249",{"$nulls":3},"8717332259274"]
[null,"6650 000 12788","FMC-420RW-GSRYE","F.01U.012.788","MCP_LSNi_INDOOR_SURFMT_RESET_YEL","5A",72.74,{"v":342,"d":"342.00"},"3","C","A",8536501999,"CN",27,"0.249",{"$nulls":3},"8717332259281"]
[null,665000012709,"FMC-420RW-HSGRD","F.01U.012.709","MCP LSNi, Outdoor (H), Surface mounted, Glass, Red","5A",239.48,{"v":1127,"d":"1,127.00"},"3","C","A",8536501999,"CN",9,"0.3",{"$nulls":3},8717332259212]
[null,665000012780,"FMC-420RW-HSRRD","F.01U.012.780","MCP LSNi, Outdoor (H), Surface mounted, Resettable, Red","5A",239.48,{"v":1127,"d":"1,127.00"},"3","C",1,8536501999,"CN",36,"0.468",{"$nulls":3},8717332259229]
[null,"7050 002 49820","FMC-420IS-GSRRD","F.01U.249.820","Manual call point resettable red, Israel","5A",71.95,{"v":338,"d":"338.00"},"3","C","C","85319000","CN",0,0.27,null,null,"Mainly used for Israel",8717332828876]
[null,"Conventional manual call points",null,"",{"$nulls":4},"",{"$nulls":4},"",""]
[null,"6650 000 11951","FMC-120-DKM-G-R","F.01U.011.951","FMC-120-DKM-G-R MCP conv indoor red","5A",40.88,{"v":192,"d":"192.00"},"3","C",1,8536501999,"CN",59,"0.243",null,"SBN",null,8717332250073]
[null,"6650 000 11952","FMC-120-DKM-H-R","F.01U.011.952","FMC-120-DKM-H-R MCP conv outdoor red","5A",102.89,{"v":484,"d":"484.00"},"3","C","A",8536501999,"CN",23,"0.233",null,"SBN",null,8717332250080]
[null,"6650 000 11953","FMC-120-DKM-G-B","F.01U.011.953","FMC-120-DKM-G-B MCP conv Indoor blue","5A",40.88,{"v":192,"d":"192.00"},"3","C","A",8536501999,"CN",69,"0.224",null,"SBN",null,8717332250097]
[null,"6650 000 11954","FMC-120-DKM-H-B","F.01U.011.954","FMC-120-DKM-H-B MCP conv Outdoor blue","5A",102.89,{"v":484,"d":"484.00"},"3","C","A",8536501999,"CN",4,"0.237",null,"SBN",null,8717332250103]
[null,"6650 000 12763","FMC-120-EST-G-B","F.01U.012.763","FMC-120-EST-G-B Stop dev. indoor, blue","5A",61.59,{"v":290,"d":"290.00"},"3","C","A",8536501999,"CN",17,"0.224",null,"SBN",null,8717332258024]
[null,"6650 000 11955","FMC-120-DKM-G-Y","F.01U.011.955","FMC-120-DKM-G-Y MCP conv Indoor yellow","5A",40.88,{"v":192,"d":"192.00"},"3","C","A",8536501999,"CN",135,"0.222",null,"SBN",null,8717332250110]
[null,"6650 000 12771","FMC-300RW-GSGRD","F.01U.012.771","MCP_CONV_820_INDOOR_SURFMT_GLASS_RED","5A",37.62,{"v":177,"d":"177.00"},"3","C","A",8536501999,"CN",3,"0.249",{"$nulls":3},8717332259090]
[null,"6650 000 12777","FMC-300RW-GSRRD","F.01U.012.777","MCP_CONV_820_INDOOR_SURFMT_RESET_RED","5A",37.62,{"v":177,"d":"177.00"},"3","C","A",8536501999,"CN",146,"0.27",{"$nulls":3},8717332259168]
[null,"6650 000 12724","FMC-300RW-GSGBU","F.01U.012.724","MCP_CONV_820_INDOOR_SURFMT_GLASS_BLUE","5A",37.62,{"v":177,"d":"177.00"},"3","C","A",8536501999,"CN",2,"0.241",{"$nulls":3},"8717332259144"]
[null,"6650 000 12770","FMC-300RW-GSRBU","F.01U.012.770","MCP_CONV_820_INDOOR_SURFMT_RESET_BLUE","5A",37.62,{"v":177,"d":"177.00"},"3","C","A",8536501999,"CN",8,"0.249",{"$nulls":3},"8717332259083"]
[null,"6650 000 12778","FMC-300RW-GSGYE","F.01U.012.778","MCP_CONV_820_INDOOR_SURFMT_GLASS_YEL","5A",37.62,{"v":177,"d":"177.00"},"3","C","A",8536501999,"CN",2,"0.249",{"$nulls":3},"8717332259175"]
[null,"6650 000 12779","FMC-300RW-GSRYE","F.01U.012.779","MCP_CONV_820_INDOOR_SURFMT_RESET_YEL","5A",37.62,{"v":177,"d":"177.00"},"3","C","A",8536501999,"CN",23,"0.233",{"$nulls":3},"8717332259182"]
[null,"Conventional manual call points for ex areas",{"$nulls":6},"",{"$nulls":4},"",""]
[null,"6649 980 10934","DKM 2014/2-ex-UGM","4.998.010.934","Ex DKM Type K f UGM-GLT conv manual call point","5A",{"v":2244.91,"d":"2,244.91"},{"v":10560,"d":"10,560.00"},"3","C","A",8536501999,"DE",1,"1.552",{"$nulls":3},8717332019847]
[null,"6649 980 10933","DKM 2014/2-ex","4.998.010.933","double action button, form K, red","5A",{"v":2244.91,"d":"2,244.91"},{"v":10560,"d":"10,560.00"},"3","C","A",8536501999,"DE","","1.527",{"$nulls":3},8717332019830]
[null,"6649 981 12084","DM1103B-Ex","4.998.112.084","DM 1103B-EXP, manual call point, double action, red, connect to ex-barrier SB3","5A",408.88,{"v":1923,"d":"1,923.00"},"3","C","A",8536501999,"CN",5,"0.333",{"$nulls":3},8717332003648]
[null,"Accessories - manual call points LSN and conventional",{"$nulls":6},"",{"$nulls":4},"",""]
[null,"6650 000 12951","FMC-FST-DE","F.01U.012.951","FMC-FST-DE Foil set transp","5A",164.38,{"v":773,"d":"773.00"},"3","C","A",3919908099,"DE",9,"0.07",null,"-",null,"8717332250202"]
[null,"7750 000 25845","FMC-SPGL-DEIL","F.01U.025.845","Spare glass pane for MCP, 5 glasses","5A",33.82,{"v":159,"d":"159.00"},"3","C","A",70060090,"DE",131,"0.075",{"$nulls":3},8717332252374]
[null,"6649 981 03969","SM210-SPARE-GLASS","4.998.103.969","spare glass, SM 210 LSN RW / SM 120 RW (10 pc)","5A",25.08,{"v":118,"d":"118.00"},"3","C","A",70060090,"GB",12,"0.116",null,"-",null,8717332003518]
[null,"6649 980 01364","FMM-plate-blue","4.998.001.364","Insert plate DKM120 blue for test call points","5A",19.81,{"v":93,"d":"93.00"},"3","C","A",7610909000,"DE",12,"0.017",null,"-",null,8717332019700]
[null,"6637 566 30007","FMM-KEY-Form G/H","3.756.630.007","Key for Manual Callpoint","5A",1.79,{"$f":"ROUND(ROUND(G363*4.704,2),0)","v":{"v":8,"d":"8.00"}},"3","C","A",85319010,"CN",401,"0.017",null,"-",null,8717332022724]
[null,"7733 022 00737","FMM-SEAL-RED","3.302.200.737","seal red","5A",15.61,{"v":73,"d":"73.00"},"3","C","A",3926909790,"DE",103,"0.012",null,"-",null,871733209655]
[null,"6649 981 03190","DKM120-LABEL","4.998.103.190","stickers without text for own lettering, 10 foils with 6 pc each (for laser printer)","5A",13.68,{"v":64,"d":"64.00"},"3","C","A",3919101990,"DE",22,"0.15","Delivered in packages of 10 pcs. If 30 pcs needed, order 3 pcs.","-",null,8717332003501]
[null,"7050 000 73045","FMC-BEZEL-RD","F.01U.073.045","FMC-BEZEL-RD Bezel for MCP RW, red ","5A",30.04,{"v":141,"d":"141.00"},"3","C","A",3926909790,"CN",8,"0.175","Delivered in packages of 4 pcs. If 12 pcs needed, order 3 pcs.",null,null,8717332324859]
[null,"7050 000 73046","FMC-BEZEL-WH","F.01U.073.046","FMC-BEZEL-WH Bezel for MCP RW, white","5A",30.04,{"v":141,"d":"141.00"},"3","C","C",3926909790,"CN",0,"0.183","Delivered in packages of 4 pcs. If 12 pcs needed, order 3 pcs.",null,null,8717332324866]
[null,"6650 000 13460","FMC-Spacer-RWRD","F.01U.013.460","FMC-SPACER-RWRD Spacer for MCP RW, red","5A",12.93,{"v":61,"d":"61.00"},"3","C","C",3926909790,"CN",0,"0.03",{"$nulls":3},"8717332259304"]
[null,"6650 000 13504","FMC-SPGL-RW","F.01U.013.504","FMC-SPGL-RW Spare glass for MCP RW","5A",49.94,{"v":235,"d":"235.00"},"3","C","A",70060090,"CN",16,"0.07","Delivered in packages of 5 pcs. If 15 pcs needed, order 3 pcs.",null,null,"8717332259045"]
[null,"6650 000 28195","FMC-SIGN-RW","F.01U.028.195","FMC-SIGN-RW Out of order sign for MCP RW","5A",12.93,{"v":61,"d":"61.00"},"3","C","C",3926909790,"CN",0,"0.05",{"$nulls":3},"8717332259601"]
[null,"6650 000 28227","FMC-KEY-RW","F.01U.028.227","FMC-KEY-RW Test key for MCP RW","5A",1.23,{"v":6,"d":"6.00"},"3","C","A",3926909790,"CN",440,"0.001",{"$nulls":3},"8717332259724"]
[null,"6650 000 28194","FMC-FLAP-RW","F.01U.028.194","FMC-FLAP-RW clear hinged flap for MCP RW (1 unit= 5 pieces)","5A",18.25,{"v":86,"d":"86.00"},"3","C","A",3926909790,"CN",124,"0.099","Delivered in packages of 5 pcs. If 15 pcs needed, order 3 pcs.",null,null,"8717332259595"]
[null,"7050 000 73214","FMC-SEAL-RW","F.01U.073.214","FMC-SEAL-RW Seal for MCP RW","5A",27.38,{"v":129,"d":"129.00"},"3","C","C",8309909090,"CN",0,"0.008","Delivered in packages of 100 pcs.if 200 pcs needed, order 2 pcs. (packages). REUP per 100 pcs",null,null,8717332325252]
[null,"LSN interface modules",null,"",{"$nulls":4},"",{"$nulls":4},"",""]
[null,"AVENAR IO module 4000",null,"",{"$nulls":4},"",{"$nulls":4},"",""]
[null,"7050 004 02681","FLM-430-I2M1","F.01U.402.681","Interface module 2 inputs 1 output","5A",223.13,{"v":1050,"d":"1,050.00"},"5","C","A",85371098,"PT",null,"0.135",null,"SBN",null,4060039153524]
[null,"7051 004 02681","FLM-430-SMB","F.01U.402.682","Surface mount box","5A",47.82,{"v":225,"d":"225.00"},"5","C","A",39269097,"PT",null,"0.317",null,"SBN",null,4060039153531]
[null,"7052 004 02681","FLM-430-CLIP","F.01U.402.683","DIN clip for interface module","5A",19.13,{"v":90,"d":"90.00"},"5","C","A",39269097,"PT",null,"0.021","One unit contains 5 clips and 11 screws","SBN",null,4060039153548]
[null,"7053 004 02681","FLM-430-CABLE","F.01U.402.684","Cable kit for interface module","5A",31.88,{"v":150,"d":"150.00"},"5","C","A",85444290,"PT",null,"0.034","One unit contains 5 cables","SBN",null,4060039153555]
[null,"Series 420",null,"",{"$nulls":4},"",{"$nulls":4},"",""]
[null,"6650 000 33255","FLM-420-O8I2-S","F.01U.033.255","Interface 8 OC outputs + 2 inputs, surface mount","5A",227.23,{"v":1069,"d":"1,069.00"},"5","C","A",8517620000,"CN",20,"0.563",{"$nulls":3},8717332288403]
[null,"6650 000 33257","FLM-420-O1I1-E","F.01U.033.257","Interface 1 OC output + 1 input, integration mount","5A",108.01,{"v":508,"d":"508.00"},"5","C","A",8517620000,"CN",532,"0.133",{"$nulls":3},8717332288427]
[null,"6650 000 33256","FLM-420-O1I1-D","F.01U.033.256","Interface 1 OC output + 1 input, DIN rail","5A",133.42,{"v":628,"d":"628.00"},"5","C","A",8517620000,"CN",122,"0.316",{"$nulls":3},8717332288410]
[null,"7050 000 80970","FLM-420-RLE-S","F.01U.080.970","Interface for extinguishing panels, surface mount & DIN rail","5A",193.56,{"v":911,"d":"911.00"},"5","C","A",8536501999,"CN",169,"0.45",{"$nulls":3},8717332349562]
[null,"6650 000 33247","FLM-420-RLV8-S","F.01U.033.247","Interface 8 relay outputs, surface mount","5A",285.29,{"v":1342,"d":"1,342.00"},"5","C",1,8517620000,"CN",355,"0.648",{"$nulls":3},8717332288359]
[null,"6650 000 33251","FLM-420-I8R1-S","F.01U.033.251","Interface 8 inputs, 1 relay output, surface mount","5A",227.23,{"v":1069,"d":"1,069.00"},"5","C",1,8517620000,"CN",498,"0.666",{"$nulls":3},8717332288373]
[null,"6650 005 08710","FLM-420-RHV-S","F.01U.508.710","Interface 2 high voltage relay outputs + 2 inputs, surface mount","5A",203.05,{"v":955,"d":"955.00"},"5","C",1,8517620000,"CN",295,"0.5",null,"SBN",null,8717332099238]
[null,"6650 005 08714","FLM-420-RHV-D","F.01U.508.714","Interface 2 high voltage relay outputs + 2 inputs, DIN rail","5A",184.58,{"v":868,"d":"868.00"},"5","C","A",8517620000,"CN",108,"0.324",null,"SBN",null,8717332099252]
[null,"6650 000 12534","FLM-420/4-CON-S","F.01U.012.534","Interface two conventional zones, surface mount","5A",184.58,{"v":868,"d":"868.00"},"5","C",1,8517620000,"CN",187,"0.504",{"$nulls":3},8717332250257]
[null,"6650 000 12535","FLM-420/4-CON-D","F.01U.012.535","Interface two conventional zones, DIN rail","5A",{"v":177.2,"d":"177.20"},{"$f":"ROUND(ROUND(G390*4.704,2),0)","v":{"v":834,"d":"834.00"}},"5","C","A",8517620000,"CN",64,"0.115",{"$nulls":3},8717332250264]
[null,"7850 005 08711","FLM-I 420-S","F.01U.508.711","Stand alone short cicuit isolator, surface mount","5A",87.45,{"v":411,"d":"411.00"},"5","C","A",8517620000,"CN",16,"0.466",null,"SBN",null,8717332256020]
[null,"6650 000 12542","FLM-420-I2-W","F.01U.012.542","Interface 2 inputs, wall mount","5A",111.22,{"v":523,"d":"523.00"},"5","C","A",8517620000,"CN",34,"0.116",null,"SBN",null,8717332250295]
[null,"6650 000 12571","FLM-420-I2-E","F.01U.012.571","Interface 2 inputs, integration mount","5A",108.01,{"v":508,"d":"508.00"},"5","C","A",8517620000,"CN",243,"0.099",null,"SBN",null,8717332250301]
[null,"6650 000 12578","FLM-420-I2-D","F.01U.012.578","Interface 2 inputs, DIN rail","5A",133.42,{"v":628,"d":"628.00"},"5","C","A",8517620000,"CN",157,"0.306",null,"SBN",null,8717332250318]
[null,"6650 000 12591","FLM-420-RLV1-E","F.01U.012.591","Interface 1 relay output, integration mount","5A",108.01,{"v":508,"d":"508.00"},"5","C","A",8517620000,"CN",582,"0.106",null,"SBN",null,8717332250400]
[null,"6650 000 12594","FLM-420-RLV1-D","F.01U.012.594","Interface 1 relay output, DIN rail","5A",133.42,{"v":628,"d":"628.00"},"5","C","A",8517620000,"CN",203,"0.302",null,"SBN",null,8717332250417]
[null,"6650 000 12595","FMX-IFB55-S","F.01U.012.595","Round surface mount box for wall mount","5A",7.38,{"v":35,"d":"35.00"},"5","C","A",3926909790,"CN",39,"0.029",null,"-",null,8717332250424]
[null,"6650 000 29614","FLM-IFB126-S","F.01U.029.614","Square surface mount box for DIN rail modules","5A",22.16,{"v":104,"d":"104.00"},"5","C",1,3926909790,"CN",375,"0.349",null,"-",null,8717332264636]
[null,"7050 000 96884","FLM-420-EOL2W-W","F.01U.096.884","End of line module 2 wire LSN stub, wall mount","5A",86.01,{"v":405,"d":"405.00"},"5","C","A",8537109199,"CN",2,"0.12",{"$nulls":3},8717332381395]
[null,"7050 000 83617 ","FLM-420-EOL4W-S","F.01U.083.617","End of line module 4 wire LSN stub, surface mount","5A",172.04,{"v":809,"d":"809.00"},"5","C","A",8536501999,"CN",4,"0.48",null,"SBN",null,8717332361090]
[null,"7050 000 83618","FLM-420-EOL4W-D","F.01U.083.618","End of line module 4 wire LSN stub, DIN rail","5A",157.69,{"v":742,"d":"742.00"},"5","C","A",8536501999,"CN",0,"0.28",null,"SBN",null,8717332361106]
[null,"Signaling Devices",null,"",{"$nulls":4},"",{"$nulls":4},"",""]
[null,"AVENAR all-in-one 4000",{"$nulls":6},"",{"$nulls":4},"",""]
[null,"7050 003 59432","FNX-425U-WFWH","F.01U.359.432","Acoustic/visual alarm wh, wh","5A",389.22,{"v":1831,"d":"1,831.00"},"3","C","A","8531103000","DE",42,"0.473","Battery included, White cover not included in delivery",null,null,"4060039071873"]
[null,"7050 003 59433","FNX-425U-RFWH","F.01U.359.433","Acoustic/visual alarm rd, wh","5A",389.22,{"v":1831,"d":"1,831.00"},"3","C","A","8531103000","DE",60,"0.473","Battery included, White cover not included in delivery",null,null,"4060039071880"]
[null,"7050 003 59434","FNX-425U-WFRD","F.01U.359.434","Acoustic/visual alarm wh, rd","5A",389.22,{"v":1831,"d":"1,831.00"},"3","C","A","8531103000","DE",39,"0.473","Battery included. Red cover is included in delivery",null,null,"4060039071897"]
[null,"7050 003 59435","FNX-425U-RFRD","F.01U.359.435","Acoustic/visual alarm rd, rd","5A",389.22,{"v":1831,"d":"1,831.00"},"3","C","A","8531103000","DE",37,"0.473","Battery included. Red cover is included in delivery",null,null,"4060039071903"]
[null,"7050 003 59438","FNX-425U-BAT","F.01U.359.438","Battery for AVENAR all-in-one 4000","5A",845.33,{"v":3976,"d":"3,976.00"},"1","C","A","8506501090","DE",3,"0.051","1 unit contains 10 batteries. If 20 pcs needed, order 2 unit",null,"Package quantity changed from 30pcs to 10pcs","4060039071934"]
[null,"7050 003 59436","FNX-425U-COVWH","F.01U.359.436","Cover white for AVENAR all-in-one 4000","5A",125.46,{"v":590,"d":"590.00"},"3","C","A","8531900000","DE",20,"0.036","1 unit contains 10 covers; if 50 pcs needed, order 5 unit",null,null,"4060039071910"]
[null,"7050 003 59437","FNX-425U-COVRD","F.01U.359.437","Cover red for AVENAR all-in-one 4000","5A",125.46,{"v":590,"d":"590.00"},"3","C","A","8531900000","DE",1,"0.036","1 unit contains 10 covers; if 50 pcs needed, order 5 unit",null,null,"4060039071927"]
[null,"Acoustic Signaling Devices",null,"",{"$nulls":4},"",{"$nulls":4},"",""]
[null,"7050 001 68575","FNM-420U-A-BSWH","F.01U.168.575","Base Sounder Indoor uninterruptible, wh","5A",165.79,{"v":780,"d":"780.00"},"3","C","A",8531103000,"CN",2179,"0.215","Battery is included; Cover is not included",null,null,8717332770762]
[null,"7050 001 68576","FNM-420U-A-BSRD","F.01U.168.576","Base Sounder Indoor uninterruptible, rd","5A",165.79,{"v":780,"d":"780.00"},"3","C","A",8531103000,"CN",28,"0.215","Battery is included;  Cover is included",null,null,8717332770779]
[null,"7050 001 68577","FNM-420U-A-RD","F.01U.168.577","Sounder Indoor uninterruptible, red","5A",174.03,{"v":819,"d":"819.00"},"3","C","A",8531103000,"CN",348,"0.245",{"$nulls":3},8717332770786]
[null,"7050 001 68578","FNM-420U-A-WH","F.01U.168.578","Sounder Indoor uninterruptible, white","5A",174.03,{"v":819,"d":"819.00"},"3","C",1,8531103000,"CN",354,"0.245",{"$nulls":3},8717332770793]
[null,"7050 001 68579","FNM-420U-B-RD","F.01U.168.579","Sounder Outdoor uninterruptible, red","5A",191.79,{"v":902,"d":"902.00"},"3","C","A",8531103000,"CN",86,"0.325",{"$nulls":3},8717332770809]
[null,"7050 001 68622","FNM-BATTERIES","F.01U.168.622","Batteries for FNM-420U Sounders (20pcs multipack)","5A",348.05,{"v":1637,"d":"1,637.00"},"3","C","A",8531103000,"CN",9,"0.45","Delivered in packages of 20 pcs. If 40 pcs needed, order 2 pcs.",null,null,8717332770823]
[null,"7050 006 64687","FNM-420-A-BS-WH","F.01U.064.687","Base Sounder Indoor, White","5A",{"v":137.8,"d":"137.80"},{"v":648,"d":"648.00"},"3","C",1,8531103000,"CN",390,"0.198","Cover is not included",null,null,8717332311323]
[null,"7050 006 64688","FNM-420-A-BS-RD","F.01U.064.688","Base Sounder Indoor, Red, LSNimpr.","5A",{"v":137.8,"d":"137.80"},{"v":648,"d":"648.00"},"3","C",1,8531103000,"CN",105,"0.21","Cover is included",null,null,8717332311330]
[null,"7050 006 64689","FNM-420-A-WH","F.01U.064.689","Sounder Indoor, White","5A",143.48,{"v":675,"d":"675.00"},"3","C","A",8531103000,"CN",36,"0.25",{"$nulls":3},8717332311347]
[null,"7050 006 64690","FNM-420-A-RD","F.01U.064.690","Sounder Indoor, Red","5A",143.48,{"v":675,"d":"675.00"},"3","C",1,8531103000,"CN",178,"0.216",{"$nulls":3},8717332311354]
[null,"7050 006 64691","FNM-420-B-RD","F.01U.064.691","Sounder Outdoor, Red","5A",167.78,{"v":789,"d":"789.00"},"3","C",1,8531103000,"CN",55,"0.299",{"$nulls":3},8717332311361]
[null,"7050 006 64694","FNM-COVER-RD","F.01U.064.694","Cover for Base Sounder, Red","5A",110.99,{"v":522,"d":"522.00"},"3","C","A",8531103000,"Slovakia",4,"0.25","Delivered in packages of 10 pcs. If 30 pcs needed, order 3 pcs.",null,null,8717332311392]
[null,"7050 006 64695","FNM-COVER-WH","F.01U.064.695","Cover for Base Sounder, White","5A",110.99,{"v":522,"d":"522.00"},"3","C","A",8531103000,"Slovakia",17,"0.25","Delivered in packages of 10 pcs. If 30 pcs needed, order 3 pcs.",null,null,8717332311408]
[null,"7050 006 64692","FNM-SPACER-WH","F.01U.064.692","Spacer for Surf. Cabl., White, FNM-420","5A",173.13,{"v":814,"d":"814.00"},"3","C",1,8531103000,"CN",64,"0.49","Delivered in packages of 10 pcs. If 30 pcs needed, order 3 pcs.",null,null,8717332311378]
[null,"7050 006 64693","FNM-SPACER-RD","F.01U.064.693","Spacer for Surf. Cabl., Red, FNM-420","5A",173.13,{"v":814,"d":"814.00"},"3","C","A",8531103000,"CN",5,"0.49","Delivered in packages of 10 pcs. If 30 pcs needed, order 3 pcs.",null,null,8717332311385]
[null,"6627 993 50351","DS10-24V","2.799.350.351","DS 10 DIN-tone sounder, 24 V, 110 dB, surface mounted","5A",570.24,{"v":2682,"d":"2,682.00"},"3","C","A",8531900000,"DE",6,"1.935",null,"SBN",null,8717332019199]
[null,"6627 993 50352","DS10-230V","2.799.350.352","DS 10 DIN-tone sounder, 220V 110dB,  surface mounted","5A",609.31,{"v":2866,"d":"2,866.00"},"3","C","C",8531900000,"DE",1,"2.217",null,"SBN",null,8717332019205]
[null,"7050 001 43878","FNM-320-SRD","F.01U.143.878","FNM-320-SRD Sounder, Surface-mount, Red","5A",64.37,{"v":303,"d":"303.00"},"3","C","A",8531103000,"CN",161,"0.252",{"$nulls":3},8717332494477]
[null,"7050 001 43879","FNM-320-FRD","F.01U.143.879","FNM-320-FRD Sounder, Flush-mount, Red","5A",60.37,{"v":284,"d":"284.00"},"3","C","A",8531103000,"CN",31,"0.238",{"$nulls":3},8717332494484]
[null,"7050 001 43880","FNM-320-SWH","F.01U.143.880","FNM-320-SRD Sounder, Surface-mount, Whit","5A",64.37,{"v":303,"d":"303.00"},"3","C","A",8531103000,"CN",61,"0.242",{"$nulls":3},8717332494491]
[null,"7050 001 43881","FNM-320-FWH","F.01U.143.881","FNM-320-FRD Sounder, Flush-mount, White","5A",60.37,{"v":284,"d":"284.00"},"3","C","A",8531103000,"CN",73,"0.238",{"$nulls":3},8717332494507]
[null,"7050 001 43882","FNM-320LED-SRD","F.01U.143.882","FNM-320LED-SRD Sounder with LED, Surface","5A",138.51,{"v":652,"d":"652.00"},"3","C","A",8531103000,"CN",73,"0.292",{"$nulls":3},8717332494514]
[null,"7050 003 93222","PA 10-SSM","F.01U.393.222","Industrial sounder, high","5A",563.25,{"v":2650,"d":"2,650.00"},"3","C","A",85318070,"DE",0,"1.060",{"$nulls":3},4060039128270]
[null,"7050 003 93223","PA 5","F.01U.393.223","Industrial sounder, low","5A",338.36,{"v":1592,"d":"1,592.00"},"3","C","A",85318070,"DE",1,"0.640",{"$nulls":3},4060039128287]
[null,null,"BexS110D-24 DC","F.01U.426.429","Ex-proof sounder, performance ","5A",{"v":4031.55,"d":"4,031.55"},{"v":18964,"d":"18,964.00"},"3","C","A",85311030,"UK",null,"3.160",{"$nulls":3},4060039201850]
[null,"Optical Signaling Devices",null,"",{"$nulls":4},"",{"$nulls":4},"",""]
[null,"7050 002 88456","SOL-LX-C-WF-W-S","F.01U.288.456","Beacon Ceiling, white flash/ white/ shallow","5A",109.37,{"v":514,"d":"514.00"},"3","C","A",8531103000,"CN",45,"0.105",{"$nulls":3},8717332925155]
[null,"7050 002 88457","SOL-LX-C-RF-W-S","F.01U.288.457","Beacon Ceiling, red flash/ white/ shallow","5A",109.37,{"v":514,"d":"514.00"},"3","C","A",8531103000,"CN",52,"0.105",{"$nulls":3},8717332925162]
[null,"7050 002 88458","SOL-LX-C-WF-W-D","F.01U.288.458","Beacon Ceiling, white flash/ white/deep","5A",109.37,{"v":514,"d":"514.00"},"3","C","C",8531103000,"CN",0,"0.136",{"$nulls":3},8717332925179]
[null,"7051 002 88459","SOL-LX-C-RF-W-D","F.01U.288.459","Beacon Ceiling, red flash/ white/deep","5A",109.37,{"v":514,"d":"514.00"},"3","C","A",8531103000,"CN",19,"0.136",{"$nulls":3},8717332925186]
[null,"7051 002 88460","SOL-LX-W-WF-W-S","F.01U.288.460","Beacon Wall, white flash /white/shallow","5A",109.37,{"v":514,"d":"514.00"},"3","C","A",8531103000,"CN",7,"0.105",{"$nulls":3},8717332925193]
[null,"7051 002 88461","SOL-LX-W-RF-W-S","F.01U.288.461","Beacon Wall, red flash /white/shallow","5A",109.37,{"v":514,"d":"514.00"},"3","C","A",8531103000,"CN",4,"0.105",{"$nulls":3},8717332925209]
[null,"7052 002 88462","SOL-LX-W-WF-W-D","F.01U.288.462","Beacon Wall, white flash /white/deep","5A",109.37,{"v":514,"d":"514.00"},"3","C","A",8531103000,"CN",10,"0.136",{"$nulls":3},8717332925216]
[null,"7052 002 88463","SOL-LX-W-RF-W-D","F.01U.288.463","Beacon Wall, red flash /white/deep","5A",109.37,{"v":514,"d":"514.00"},"3","C","A",8531103000,"CN",13,"0.136",{"$nulls":3},8717332925223]
[null,"7052 002 88464","SOL-LX-W-WF-R-S","F.01U.288.464","Beacon Wall, white flash /red/shallow","5A",109.37,{"v":514,"d":"514.00"},"3","C","A",8531103000,"CN",20,"0.105",{"$nulls":3},8717332925230]
[null,"7053 002 88465","SOL-LX-W-RF-R-S","F.01U.288.465","Beacon Wall, red flash /red/shallow","5A",109.37,{"v":514,"d":"514.00"},"3","C","A",8531103000,"CN",20,"0.105",{"$nulls":3},8717332925247]
[null,"7053 002 88466","SOL-LX-W-WF-R-D","F.01U.288.466","Beacon Wall, white flash /red/deep","5A",109.37,{"v":514,"d":"514.00"},"3","C","A",8531103000,"CN",12,"0.105",{"$nulls":3},8717332925254]
[null,"7053 002 88467","SOL-LX-W-RF-R-D","F.01U.288.467","Beacon Wall, red flash /red/deep","5A",109.37,{"v":514,"d":"514.00"},"3","C","A",8531103000,"CN",61,"0.136",{"$nulls":3},8717332925261]
[null,"7050 001 24386","FNS-P400RTH-R","F.01U.124.386","Rotating Beacon Red","5A",242.22,{"v":1139,"d":"1,139.00"},"3","C","A",85318070,"DE",1,"0.818",{"$nulls":3},8717332402854]
[null,"7050 001 24387","FNS-P400RTH-Y","F.01U.124.387","Rotating Beacon Yellow","5A",242.22,{"v":1139,"d":"1,139.00"},"3","C","A",85318070,"DE",1,"0.801",{"$nulls":3},8717332402861]
[null,"7050 001 43883","FNS-320-SRD","F.01U.143.883","FNS-320-SRD Beacon, Surface-mount, Red","5A",77.69,{"v":365,"d":"365.00"},"3","C","A",8531103000,"CN",47,"0.216",{"$nulls":3},8717332494521]
[null,"7050 001 43884","FNS-320-SYE","F.01U.143.884","FNS-320-SYE Beacon, Surface-mount, Amber","5A",77.69,{"v":365,"d":"365.00"},"3","C","A",8531103000,"CN",10,"0.172",{"$nulls":3},8717332494538]
[null,"7050 001 43885","FNS-320-SWH","F.01U.143.885","FNS-320-SWH Beacon, Surface-mount, White","5A",77.69,{"$f":"ROUND(ROUND(G454*4.704,2),0)","v":{"v":365,"d":"365.00"}},"3","C","A",8531103000,"CN",4,"0.291",{"$nulls":3},8717332494545]
[null,"7050 001 43886","FNS-320-SGR","F.01U.143.886","FNS-320-SGR Beacon, Surface-mount, Green","5A",77.69,{"v":365,"d":"365.00"},"3","C","A",8531103000,"CN",2,"0.291",{"$nulls":3},8717332494552]
[null,"6650 005 16089","FNS-420-R","F.01U.516.089","Strobe for base sounder red","5A",134.11,{"v":631,"d":"631.00"},"3","C","A",8531900000,"CN",274,"0.077",null,null,"Not allowed for fire applications within the EU.",8717332282999]
[null,"7050 001 32440","FNA-P400RBA-MB","F.01U.132.440","Mounting Bracket for FNS-P400RTH","5A",62.33,{"v":293,"d":"293.00"},"3","C","A",3926909790,"DE",1,"0.095",{"$nulls":3},8717332457519]
[null,"7050 003 93220","PY X-M-10-SSM R","F.01U.393.220","Industrial strobe SSM, red","5A",519.17,{"v":2442,"d":"2,442.00"},"3","C","A",85318070,"DE",0,"0.440",{"$nulls":3},4060039128256]
[null,"7050 003 93221","PY X-M-10-SSM W","F.01U.393.221","Industrial strobe SSM, white","5A",519.17,{"v":2442,"d":"2,442.00"},"3","C","A",85318070,"DE",3,"0.440",{"$nulls":3},4060039128263]
[null,"Optical + Acoustical Signaling Devices Combination",{"$nulls":6},"",{"$nulls":4},"",""]
[null,"7050 002 88468","ROLP-W-LX-W-WF","F.01U.288.468","Sounder Beacon, white /wall/white flash","5A",{"v":159.1,"d":"159.10"},{"v":748,"d":"748.00"},"3","C","A",8531103000,"CN",24,"0.283",{"$nulls":3},8717332925278]
[null,"7050 002 88469","ROLP-W-LX-W-RF","F.01U.288.469","Sounder Beacon, white/wall/red flash","5A",{"v":159.1,"d":"159.10"},{"v":748,"d":"748.00"},"3","C","A",8531103000,"CN",25,"0.283",{"$nulls":3},8717332925285]
[null,"7050 002 88470","ROLP-R-LX-W-WF","F.01U.288.470","Sounder Beacon, red/wall/white flash","5A",{"v":159.1,"d":"159.10"},{"v":748,"d":"748.00"},"3","C","A",8531103000,"CN",39,"0.283",{"$nulls":3},8717332925292]
[null,"7050 002 88471","ROLP-R-LX-W-RF","F.01U.288.471","Sounder Beacon, red/wall/red flash","5A",{"v":159.1,"d":"159.10"},{"v":748,"d":"748.00"},"3","C","A",8531103000,"CN",160,"0.283",{"$nulls":3},8717332925308]
[null,"Test Equipments",null,"",{"$nulls":4},"",{"$nulls":4},"",""]
[null,"6650 005 08720","FAA-500-RTL","F.01U.508.720","FAA-500-RTL removal tool","5A",{"v":1115.24,"d":"1,115.24"},{"v":5246,"d":"5,246.00"},"3","C","A",8205598000,"GB",0,"0.785",null,"SBN",null,"8717332097692"]
[null,"6650 005 08725","FAA-500-TTL","F.01U.508.725","FAA-TTL Test adapter with magnet  ","5A",494.98,{"v":2328,"d":"2,328.00"},"3","S","A",3926909790,"GB",2,"0.116",null,"SBN",null,"8717332097708"]
[null,"7050 003 63162","SOLO461","F.01U.363.162","Cordless heat detector test kit","5A",{"v":1983.6,"d":"1,983.60"},{"v":9331,"d":"9,331.00"},"3","C","A",3926909790,"GB",1,"2.35",null,"SBN",null,4060039081209]
[null,"6649 981 12071","SOLO330","4.998.112.071","Test device for optical smoke detectors","5A",556.99,{"v":2620,"d":"2,620.00"},"3","C","A",3926909790,"GB",5,"0.73",null,"SBN",null,8717332003600]
[null,"7050 003 45557","FME-SOLO-A10S","F.01U.345.557","Test Aerosol spray for Optical Smoke Detectors","5A",76.31,{"v":359,"d":"359.00"},"3","C","A",4911990000,"GB",439,"0.24","Order only 12 pcs or multiple of 12. E.g. needed 30 pcs, order 36 pcs","-",null,4060039009142]
[null,"7050 003 01469","FME-TEST-CO","F.01U.301.469","Spray with CO testing gas for multisensor detectors with C-component","5A",81.88,{"v":385,"d":"385.00"},"3","C","A",3824840000,"GB",51,"0.05",null,"-",null,8717332955183]
[null,"6649 981 12073","SOLO610","4.998.112.073","Carry bag for Solo service kit","5A",370.92,{"v":1745,"d":"1,745.00"},"3","C","A",4202929890,"GB",5,"2.52",null,"-",null,8717332020447]
[null,"7050 003 63163","SOLO770","F.01U.363.163","SOLO770 Spare battery- pack","5A",403.18,{"v":1897,"d":"1,897.00"},"3","C","A",3926909790,"GB","","0.466",null,"SBN",null,4060039081216]
[null,"6649 981 12113","SOLO200","4.998.112.113","Universal detector removal tool without pole","5A",743.07,{"v":3495,"d":"3,495.00"},"3","C","A",8205598000,"GB",1,"1.221",null,"SBN",null,8717332003679]
[null,"6649 981 12069","SOLO100","4.998.112.069","Extension pole for detector removal tool - 1-3,4m","5A",{"v":1363.34,"d":"1,363.34"},{"v":6413,"d":"6,413.00"},"3","C","A",3926909790,"GB",4,"1.04","In US the product is called SOLO 100, in other countries SOLO106-126, see changed datasheet","SBN",null,8717332003587]
[null,"6649 981 12070","SOLO101","4.998.112.070","Fibreglass extension rod (1m)","5A",284.08,{"v":1336,"d":"1,336.00"},"3","C","A",3926909790,"GB",10,"0.38",null,"SBN",null,8717332003594]
[null,"6649 980 82502","RTL-cap","4.998.082.502","Plastic cap for detector removal tool, 2 pcs are needed","5A",32.25,{"v":152,"d":"152.00"},"3","C","A",3926909790,"GB",3,"0.083",null,"-",null,8717332020089]
[null,705000169803,"FME-420-LSN-TTL","F.01U.169.803","LSN improved Test Tool","5A",{"v":5093.68,"d":"5,093.68"},{"v":23961,"d":"23,961.00"},"3","C","C",90303900,"DE",4,"5.092",{"$nulls":3},8717332774494]
[null,"Fire Service Control Panel and Door Control Units",{"$nulls":6},"",{"$nulls":4},"",""]
[null,"Fire Service Control Panel",null,"",{"$nulls":4},"",{"$nulls":4},"",""]
[null,705000288669,"FMF-ADP-TTY","F.01U.288.669","Fire Brigade Peripheral Ring Bus Module TTY interface","5A",563.52,{"v":2651,"d":"2,651.00"},"3","C","C",8538909999,"DE",11,"0.184",null,"-",null,8717332925537]
[null,705000317733,"FMF-ADP-FBF","F.01U.317.733","Fire Brigade Peripheral Ring Bus Module for UEZ-2000 and BZ-500","5A",769.13,{"v":3618,"d":"3,618.00"},"3","C","C",8538909999,"DE",0,0.2,null,"-",null,8717332541201]
[null,"F.01U.288.674","FMF-FBF-FAT","F.01U.288.674","Fire Brigade Peripheral FAT and FBF","5A",{"v":1554.25,"d":"1,554.25"},{"v":7311,"d":"7,311.00"},"3","C","C",8531103000,"DE",3,3.72,null,"-","only German version",8717332925582]
[null,"F.01U.288.675","FMF-ESPA","F.01U.288.675","ESPA interface","5A",233.35,{"v":1098,"d":"1,098.00"},"3","C","C",8531103000,"DE",0,0.14,null,"-",null,8717332925599]
[null,"F.01U.288.676","FMF-FIBS-A4","F.01U.288.676","Fire brigade information center A4","5A",{"v":2700.26,"d":"2,700.26"},{"v":12702,"d":"12,702.00"},"3","C","C",8531103000,"DE",0,17.74,null,"-","only German version",8717332925605]
[null,"F.01U.288.677","FMF-FIBS-A3","F.01U.288.677","Fire brigade information center A3","5A",{"v":2700.26,"d":"2,700.26"},{"v":12702,"d":"12,702.00"},"3","C","C",8531103000,"DE",0,24,null,"-","only German version",8717332925612]
[null,"F.01U.288.706","FMF-FAT","F.01U.288.706","Fire Brigade Peripheral FAT","5A",{"v":1111.19,"d":"1,111.19"},{"v":5227,"d":"5,227.00"},"3","C","C",8531103000,"DE",0,2.2,null,"-","only German version",8717332925735]
[null,"Accessories Fire Service Control Panel",{"$nulls":6},"",{"$nulls":4},"",""]
[null,"not in MFG","SD-A","2.799.360.424","FSK-A, with housing","5A",513.47,{"v":2415,"d":"2,415.00"},"3","C","C",8531900000,"NL",0,"0.828",null,null,"only German version"]
[null,665000033702,"FMS-KR-BASIC-RPF","F.01U.033.702","Key deposit Kruse FSD 2003 12/24V-Rain","5A",{"v":2212.13,"d":"2,212.13"},{"v":10406,"d":"10,406.00"},"3","C","D",8303009000,"DE",0,"12.623",null,null,"only German version",8717332289899]
[null,"6650 000 33703","FMS-KR-BASIC","F.01U.033.703","Key deposit Kruse FSD 2003 12/24V","5A",{"v":1789.95,"d":"1,789.95"},{"v":8420,"d":"8,420.00"},"3","C","D",8303009000,"DE",0,"14.0",null,null,"only German version",8717332289905]
[null,"not in MFG","BS DKM/FIPS","4.998.149.388","BS for installation DKM in FIBS","5A",{"v":103,"d":"103.00"},{"v":485,"d":"485.00"},"3","C","A",7326909890,"DE",1,"0.125",null,null,"only German version",""]
[null,"Door Control Unit",null,"",{"$nulls":4},"",{"$nulls":4},"",""]
[null,"6627 993 30300","TSZ 0400 LSN","2.799.330.300","TSZ 0400 Door control unit","5A",563.09,{"v":2649,"d":"2,649.00"},"3","C","A",8531900000,"DE",5,"0.642",null,null,"only German version",8717332020836]
[null,"6627 993 20540","FMD-432","2.799.320.540","Push button type 432 flush-mount","5A",66.43,{"v":312,"d":"312.00"},"3","C","A",8536501999,"DE",3,"0.1",null,null,"only German version",8717332019038]
[null,"6627 993 20541","FMD-432-S","2.799.320.541","TYPE 432 PUSH BUTTON FOR SURFACE MOUNTING","5A",39.86,{"v":188,"d":"188.00"},"3","C","A",8536501999,"DE",8,"0.083",null,null,"only German version",8717332020829]
[null,"6627 993 20503","FMD-F.GT60","2.799.320.503","ASS65 ANCHOR PLATE FOR GT60","5A",81.42,{"v":383,"d":"383.00"},"3","C","A",8505902999,"DE",4,"0.27",null,null,"only German version",8717332002962]
[null,"6627 993 20504","FMD-GT60","2.799.320.504","GT60R DOOR HOLD MAGNET 24V/686N, WALL MOUNTING ","5A",253.06,{"v":1190,"d":"1,190.00"},"3","C","A",8505902999,"DE",4,"0.48",null,null,"only German version",8717332002948]
[null,"6627 993 20532","FMD-GT50","2.799.320.532","GT50R DOOR HOLD MAGNET 24V/490N, FLOOR MOUNTING","5A",465.93,{"v":2192,"d":"2,192.00"},"3","C","A",8505902999,"DE",1,"0.59",null,null,"only German version",8717332002979]
[null,"6627 993 20536","FMD-F.GT50","2.799.320.536","ASS55 ANCHOR PLATE FOR GT50","5A",61.44,{"v":289,"d":"289.00"},"3","C","A",8505909090,"DE",2,"0.098",null,null,"only German version",8717332019021]
[null,"6627 993 20539","FMD-GT50-space","2.799.320.539","GT50R WITH SPACER PIPE DOOR HOLD MAGNET, UNIV","5A",{"v":430.7,"d":"430.70"},{"v":2026,"d":"2,026.00"},"3","C","A",8505909090,"DE",1,"1.41",null,null,"only German version",8717332002986]
[null,"Services and Training"]
[null,"Scanning serial number of product",null,"",{"$nulls":4},"",{"$nulls":4},""]
["x",null,null,"F.01U.327.439","Serial Number Scanning Charge","5A",{"v":2.5,"d":"2.50"},{"v":12,"d":"12.00"},"n.a.","n.a.","n.a.","n.a.","n.a","n.a.","No physical product",null,null,"Scanning of Serial number"]
[null,"Training ","","",{"$nulls":4},"",{"$nulls":4},""]
[null,null,"TRA-FIR-FL","F.01U.328.621","Training Fire Alarm Systems","T3",{"v":918,"d":"918.00"},{"v":4318,"d":"4,318.00"},"n.a.","n.a.","n.a.","n.a.","n.a","n.a.","No physical product",null,null,"Price per person for 1 training / local, customized training organized by BU",8717332951796]
[null,null,"TRA-FPA-FE","F.01U.350.356","Training FPA-5000 - Expert","T3",{"v":612,"d":"612.00"},{"v":2879,"d":"2,879.00"},"n.a.","n.a.","n.a.","n.a.","n.a","n.a.","No physical product",null,null,"Price per person for a 2-day FPA training / organized by BU",4060039025128]
[null,null,"TRA-FPA-FM","F.01U.350.357","Training FPA-5000 - Master","T3",{"v":612,"d":"612.00"},{"v":2879,"d":"2,879.00"},"n.a.","n.a.","n.a.","n.a.","n.a","n.a.","No physical product",null,null,"Price per person for a 2-day FPA training / organized by BU",4060039025135]

{"sheet":"Warranty Extension","index":8,"n_rows":20,"n_cols":23,"rows_kept":20,"hidden":true}
["Note: For Warranty extension only base discount can be applied"]
["Commercial Type Number (CTN)","Material Number (Mat/N)","Short Description","Currency","Price [per packaging unit]","Price PLN","Price valid from [date]","Discount category","Delivery status","Last change of delivery status [date]","Last date of availability","Orders placed up to [units]","Order shipping occurrence within working [days]","Stocking location","Minimum Order Quantity [in pieces]","Multipack Quantity [in pieces]","Packaging Unit [in pieces]","Successor or Substitute Product","Country of origin","European Article Number (EAN)","Universal Product Code (UPC)","Commodity code","Dual use"]
["EWE-FPA5MPC-IW","F.01U.360.726","12mths wrty ext FPA-5000 Main Panel Con.","EUR",21.46,{"$f":"ROUND(ROUND(E3*4.8,2),0)","v":{"v":103,"d":"103.00"}},"2023-01-01","5A","S3 - available",null,null,"n.a.","Contact Customer Service","Software/Service",1,1,1,{"$nulls":5},"No"]
["EWE-FPA5FMR-IW","F.01U.360.727","12mths wrty ext FPA-5000 Remote Keypad","EUR",28.64,{"$f":"ROUND(ROUND(E4*4.8,2),0)","v":{"v":137,"d":"137.00"}},"2023-01-02","5A","S3 - available",null,null,"n.a.","Contact Customer Service","Software/Service",1,1,1,{"$nulls":5},"No"]
["EWE-FPA1200-IW","F.01U.360.728","12mths wrty ext FPA-1200","EUR",{"v":53.7,"d":"53.70"},{"v":258,"d":"258.00"},"2023-01-03","5A","S3 - available",null,null,"n.a.","Contact Customer Service","Software/Service",1,1,1,{"$nulls":5},"No"]
["EWE-FPDVC-IW","F.01U.360.729","12mths wrty ext Fire Peripheral Device","EUR",3.58,{"v":17,"d":"17.00"},"2023-01-04","5A","S3 - available",null,null,"n.a.","Contact Customer Service","Software/Service",1,1,1,{"$nulls":5},"No"]
["EWE-LSN1500-IW","F.01U.360.730","12mths wrty ext  FPA-5000 LSN 1500 Mod.","EUR",21.46,{"v":103,"d":"103.00"},"2023-01-05","5A","S3 - available",null,null,"n.a.","Contact Customer Service","Software/Service",1,1,1,{"$nulls":5},"No"]
["EWE-FPA5MD-IW","F.01U.360.731","12mths wrty ext  FPA-5000 Panel Module","EUR",7.15,{"v":34,"d":"34.00"},"2023-01-06","5A","S3 - available",null,null,"n.a.","Contact Customer Service","Software/Service",1,1,1,{"$nulls":5},"No"]
["EWE-DS10-IW","F.01U.360.732","12mths wrty ext DS10 DIN tone sounder","EUR",14.32,{"v":69,"d":"69.00"},"2023-01-07","5A","S3 - available",null,null,"n.a.","Contact Customer Service","Software/Service",1,1,1,{"$nulls":5},"No"]
["EWE-FAP520-IW","F.01U.360.733","12mths wrty ext FAP520 detector","EUR",7.15,{"v":34,"d":"34.00"},"2023-01-08","5A","S3 - available",null,null,"n.a.","Contact Customer Service","Software/Service",1,1,1,{"$nulls":5},"No"]
["EWE-FCP500-IW","F.01U.360.734","12mths wrty ext FAP500 detector","EUR",10.74,{"v":52,"d":"52.00"},"2023-01-09","5A","S3 - available",null,null,"n.a.","Contact Customer Service","Software/Service",1,1,1,{"$nulls":5},"No"]
["EWE-FPC500-IW","F.01U.360.735","12mths wrty ext  Conventional Fire panel","EUR",14.32,{"v":69,"d":"69.00"},"2023-01-10","5A","S3 - available",null,null,"n.a.","Contact Customer Service","Software/Service",1,1,1,{"$nulls":5},"No"]
["EWE-FPTDT-IW","F.01U.360.736","12mths wrty ext Fire Point Detector","EUR",3.58,{"v":17,"d":"17.00"},"2023-01-11","5A","S3 - available",null,null,"n.a.","Contact Customer Service","Software/Service",1,1,1,{"$nulls":5},"No"]
["EWE-UPS2416-IW","F.01U.360.742","12mths wrty ext UPS2426 Power Supply","EUR",14.32,{"v":69,"d":"69.00"},"2023-01-12","5A","S3 - available",null,null,"n.a.","Contact Customer Service","Software/Service",1,1,1,{"$nulls":5},"No"]
["EWE-FCS320-IW","F.01U.360.756","12mths wrty ext  FCS-320","EUR",57.26,{"v":275,"d":"275.00"},"2023-01-13","5A","S3 - available",null,null,"n.a.","Contact Customer Service","Software/Service",1,1,1,{"$nulls":5},"No"]
["EWE-FAS420-IW","F.01U.360.760","12mths wrty ext  FAS-420 TM ","EUR",64.42,{"v":309,"d":"309.00"},"2023-01-14","5A","S3 - available",null,null,"n.a.","Contact Customer Service","Software/Service",1,1,1,{"$nulls":5},"No"]
["EWE-AVIOTEC-IW","F.01U.360.765","12mths wrty ext Aviotec starlight 8000","EUR",232.65,{"v":1117,"d":"1117.00"},"2023-01-15","5A","S3 - available",null,null,"n.a.","Contact Customer Service","Software/Service",1,1,1,{"$nulls":5},"No"]
["EWE-D296-IW","F.01U.360.767","12mths wrty ext D296","EUR",{"v":23.1,"d":"23.10"},{"v":111,"d":"111.00"},"2023-01-16","5A","S3 - available",null,null,"n.a.","Contact Customer Service","Software/Service",1,1,1,{"$nulls":5},"No"]
["EWE-FPA100-IW","F.01U.360.773","12mths wrty ext FPA 1000 panel","EUR",{"v":53.7,"d":"53.70"},{"v":258,"d":"258.00"},"2023-01-17","5A","S3 - available",null,null,"n.a.","Contact Customer Service","Software/Service",1,1,1,{"$nulls":5},"No"]
["EWE-FDMOD-IW","F.01U.360.774","12mths wrty ext Fire Display Module","EUR",7.15,{"v":34,"d":"34.00"},"2023-01-17","5A","S3 - available",null,null,"n.a.","Contact Customer Service","Software/Service",1,1,1,{"$nulls":5},"No"]