{"text_format":"3","workbook":"xlsx","n_sheets":9,"sheets":["Menu Główne","Cennik SAP","Cennik Titanus - pozostałe","Dodatkowa gwarancja","Uwagi Ogólne","Fire EN 54_old","Fire EN 54 FX 4,704","Fire EN 54","Warranty Extension"],"not_rendered":{"images":214,"external_links":7,"defined_names":298},"read":"whole","date_system":"1900"}

{"sheet":"Menu Główne","index":0,"n_rows":0,"n_cols":0,"rows_kept":0}

{"sheet":"Cennik SAP","index":1,"n_rows":371,"n_cols":14,"rows_kept":371,"merged":[[1,0,1,11],[2,0,2,3],[2,5,2,11],[7,0,7,3],[7,5,7,11],[8,0,8,3],[8,5,8,11],[11,0,11,3],[11,5,11,11],[16,0,16,3],[16,5,16,11],[19,0,19,3],[19,5,19,11],[32,0,32,3],[32,5,32,11],[35,0,35,3],[35,5,35,11],[51,0,51,3],[51,5,51,11],[57,0,57,3],[57,5,57,11],[62,0,62,3],[62,5,62,11],[66,0,66,3],[66,5,66,11],[70,0,70,3],[70,5,70,11],[72,0,72,3],[72,5,72,11],[73,0,73,3],[73,5,73,11],[78,0,78,3],[78,5,78,11],[86,0,86,3],[86,5,86,11],[96,0,96,3],[96,5,96,11],[97,0,97,3],[97,5,97,11],[106,0,106,3],[106,5,106,11],[122,0,122,3],[122,5,122,11],[123,0,123,3],[123,5,123,11],[133,0,133,3],[133,5,133,11],[134,0,147,0],[148,0,148,3],[148,5,148,11],[149,0,151,0],[149,8,151,8],[153,0,154,0],[153,8,154,8],[155,0,157,0],[155,8,157,8],[158,0,159,0],[158,8,159,8],[161,0,161,3],[161,5,161,11],[174,0,174,3],[174,5,174,11],[177,0,177,3],[177,5,177,11],[186,0,186,3],[186,5,186,11],[187,0,187,3],[187,5,187,11],[192,0,192,3],[192,5,192,11],[201,0,201,3],[201,5,201,11],[202,0,202,3],[202,5,202,11],[221,0,221,3],[221,5,221,11],[226,0,226,3],[226,5,226,11],[227,0,227,3],[227,5,227,11],[230,0,230,3],[230,5,230,11],[239,0,239,3],[239,5,239,11],[252,0,252,3],[252,5,252,11],[258,0,258,3],[258,5,258,11],[260,0,260,3],[260,5,260,11],[273,0,273,3],[273,5,273,11],[274,0,274,3],[274,5,274,11],[278,0,278,3],[278,5,278,11],[279,0,279,3],[279,5,279,11],[296,0,296,3],[296,5,296,11],[307,0,307,3],[307,5,307,11],[342,0,342,3],[342,5,342,11],[343,0,345,0],[349,0,349,3],[349,5,349,11],[350,0,350,3],[350,5,350,11],[359,0,359,3],[359,5,359,11],[360,0,360,3],[360,5,360,11]]}
["ZDJĘCIE","SAP","TYP","OPIS","CENA REUP PLN","Grupa rabatowa","Klasyfikacja logistyczna kod ABC","Informacje do zamówienia","Dodatkowe uwagi","Okres gwarancji (lat)","Cena REUP przedłużenia gw.","Kraj pochodzenia","Kod taryfy celnej","Waga netto (kg)"]
[]
["Centrala AVENAR 2000"]
[null,"F.01U.383.886","FPA-2000-SWM","Centrala z kontrolerem w wersji standard, montaż ścienny. \nW skład zestawu wchodzi: 1x FPE-2000-SPC, 1x BCM-000-B, 1x LSN 0300 A, 1x PRS-0002-C, 1x PRD-0004 A, 1x UPS 2416A, 3x FDP 0001 A, 1x HCP 0006 A, 1x FPO-5000-PSB-CH.",{"$f":"VLOOKUP(B4,'Fire EN 54'!$D$5:$H$508,5,0)","v":{"v":8848,"d":"8848.00"}},"5A","A",null,null,{"$f":"VLOOKUP(B4,'Fire EN 54'!$D$5:$I$508,6,0)","v":"5"},"-","PT",{"$f":"VLOOKUP(B4,'Fire EN 54 FX 4,704'!$D$5:$L$500,9,0)","v":8537109199},{"$f":"VLOOKUP(B4,'Fire EN 54 FX 4,704'!$D$5:$O$500,12,0)","v":{"v":19.7,"d":"19.70"}}]
[null,"F.01U.383.887","FPA-2000-SFM","Centrala z kontrolerem w wersji standard, montaż na ramie.\nW skład zestawu wchodzi: 1x FPE-2000-SPC, 1x BCM-000-B, 1x LSN 0300 A, 1x PRS-0002-C, 1x PRD-0004 A, 1x UPS 2416A, 3x FDP 0001 A, 1x CPH 0006 A, 1x FBH 0000 A",{"$f":"VLOOKUP(B5,'Fire EN 54'!$D$5:$H$508,5,0)","v":{"v":9513,"d":"9513.00"}},"5A","A",null,null,{"$f":"VLOOKUP(B5,'Fire EN 54'!$D$5:$I$508,6,0)","v":"5"},"-","PT",{"$f":"VLOOKUP(B5,'Fire EN 54 FX 4,704'!$D$5:$L$500,9,0)","v":8537109199},{"$f":"VLOOKUP(B5,'Fire EN 54 FX 4,704'!$D$5:$O$500,12,0)","v":{"v":22.8,"d":"22.80"}}]
[null,"F.01U.383.888","FPA-2000-PWM","Centrala z kontrolerem w wersji premium montaż ścienny\nW skład zestawu wchodzi: 1x FPE-2000-PPC, 1x BCM-000-B, 1x LSN 0300 A, 1x PRS-0002-C, 1x PRD-0004 A, 1x UPS 2416A, 3x FDP 0001 A, 1x HCP 0006 A, 1x FPO-5000-PSB-CH",{"$f":"VLOOKUP(B6,'Fire EN 54'!$D$5:$H$508,5,0)","v":{"v":11608,"d":"11608.00"}},"5A","A",null,null,{"$f":"VLOOKUP(B6,'Fire EN 54'!$D$5:$I$508,6,0)","v":"5"},"-","PT",{"$f":"VLOOKUP(B6,'Fire EN 54 FX 4,704'!$D$5:$L$500,9,0)","v":8537109199},{"$f":"VLOOKUP(B6,'Fire EN 54 FX 4,704'!$D$5:$O$500,12,0)","v":{"v":19.7,"d":"19.70"}}]
[null,"F.01U.383.893","FPA-2000-PFM","Centrala z kontrolerem w wersji premium, montaż na ramie\nW skład zestawu wchodzi: 1x FPE-2000-PPC, 1x BCM-000-B, 1x LSN 0300 A, 1x PRS-0002-C, 1x PRD-0004 A, 1x UPS 2416A, 3x FDP 0001 A, 1x CPH 0006 A, 1x FBH 0000 A",{"$f":"VLOOKUP(B7,'Fire EN 54'!$D$5:$H$508,5,0)","v":{"v":12244,"d":"12244.00"}},"5A","A",null,null,{"$f":"VLOOKUP(B7,'Fire EN 54'!$D$5:$I$508,6,0)","v":"5"},"-","PT",{"$f":"VLOOKUP(B7,'Fire EN 54 FX 4,704'!$D$5:$L$500,9,0)","v":8537109199},{"$f":"VLOOKUP(B7,'Fire EN 54 FX 4,704'!$D$5:$O$500,12,0)","v":{"v":22.8,"d":"22.80"}}]
["Centrala AVENAR 8000"]
["Kontroler główny centrali, licencje"]
[null,"F.01U.327.090","FPE-8000-SPC","Kontroler centrali, licencja standard",{"$f":"VLOOKUP(B10,'Fire EN 54'!$D$5:$H$508,5,0)","v":{"v":4026,"d":"4026.00"}},"5A","A",null,null,{"$f":"VLOOKUP(B10,'Fire EN 54'!$D$5:$I$508,6,0)","v":5},"-","PT",{"$f":"VLOOKUP(B10,'Fire EN 54 FX 4,704'!$D$5:$L$500,9,0)","v":8537109199},{"$f":"VLOOKUP(B10,'Fire EN 54 FX 4,704'!$D$5:$O$500,12,0)","v":{"v":3.191,"d":"3.19"}}]
[null,"F.01U.352.441","FPE-8000-PPC","Kontroler centrali, licencja premium",{"$f":"VLOOKUP(B11,'Fire EN 54'!$D$5:$H$508,5,0)","v":{"v":6915,"d":"6915.00"}},"5A","A",null,null,{"$f":"VLOOKUP(B11,'Fire EN 54'!$D$5:$I$508,6,0)","v":5},"-","PT",{"$f":"VLOOKUP(B11,'Fire EN 54 FX 4,704'!$D$5:$L$500,9,0)","v":8537109199},{"$f":"VLOOKUP(B11,'Fire EN 54 FX 4,704'!$D$5:$O$500,12,0)","v":{"v":3.191,"d":"3.19"}}]
["Nexospace FSE"]
[null,"F.01U.433.333","FPO-GATE","Bezpieczna brama sieciowa do NEXOSPACE FSE",{"$f":"VLOOKUP(B13,'Fire EN 54'!$D$5:$H$508,5,0)","v":{"v":4498,"d":"4498.00"}},"5A","N/a",null,null,{"$f":"VLOOKUP(B13,'Fire EN 54'!$D$5:$I$508,6,0)","v":"1"},"-","DE",{"$f":"VLOOKUP(B13,'Fire EN 54 FX 4,704'!$D$5:$L$500,9,0)","v":8517620000},{"$f":"VLOOKUP(B13,'Fire EN 54 FX 4,704'!$D$5:$O$500,12,0)","v":{"v":1.127,"d":"1.13"}}]
[null,"F.01U.435.428","FSL-BASIC-S","NEXOSPACE FSE Licencja podstawowa S (1 rok)",{"$f":"VLOOKUP(B14,'Fire EN 54'!$D$5:$H$508,5,0)","v":{"v":1497,"d":"1497.00"}},"5A","N/a","Roczna licencja na łączność <254 punktów","Punkt = ROP lub detektor adresowalny",{"$f":"VLOOKUP(B14,'Fire EN 54'!D9:I512,6,0)","v":"n.a."},"-","DE",{"$f":"VLOOKUP(B14,'Fire EN 54 FX 4,704'!$D$5:$L$500,9,0)","v":4911990000},{"$f":"VLOOKUP(B14,'Fire EN 54 FX 4,704'!$D$5:$O$500,12,0)","v":{"v":0,"d":"0.00"}}]
[null,"F.01U.435.594","FSL-BASIC-M","NEXOSPACE FSE Licencja podstawowa M (1 rok)",{"$f":"VLOOKUP(B15,'Fire EN 54'!$D$5:$H$508,5,0)","v":{"v":4510,"d":"4510.00"}},"5A","N/a","Roczna licencja na łączność 254 - 2000 punktów","Punkt = ROP lub detektor adresowalny",{"$f":"VLOOKUP(B15,'Fire EN 54'!D10:I513,6,0)","v":"n.a."},"-","DE",{"$f":"VLOOKUP(B15,'Fire EN 54 FX 4,704'!$D$5:$L$500,9,0)","v":4911990000},{"$f":"VLOOKUP(B15,'Fire EN 54 FX 4,704'!$D$5:$O$500,12,0)","v":{"v":0,"d":"0.00"}}]
{"$rows_left_out":357}
{"sheet":"Cennik Titanus - pozostałe","index":2,"n_rows":41,"n_cols":8,"rows_kept":41,"merged":[[1,0,2,7],[4,0,4,7]]}
[]
["W przypadku zamówień mniejszych niż 7000PLN REUP (jednorazowa kwota zamówienia obejmująca tylko poniższe produkty) doliczamy opłatę za transport 200PLN. "]
[]
["SAP","TYP","OPIS","CENA REUP PLN","CENA EUR","CENA REUP PLN","Grupa rabatowa","Informacje dodatkowe"]
[]
["F.01U.363.332","PL - SF 400","Special filter 400mm",{"v":4191,"d":"4191.00"},{"$f":"D6/4.165","v":{"v":1006.2424969987995,"d":"1006.24"}},{"$f":"ROUND(ROUND(E6*4.704,2),0)","v":{"v":4733,"d":"4733.00"}},"5A"]
["F.01U.363.333","PL - SF 650","Special filter 650mm",{"v":5272,"d":"5272.00"},{"$f":"D7/4.165","v":{"v":1265.7863145258102,"d":"1265.79"}},{"$f":"ROUND(ROUND(E7*4.704,2),0)","v":{"v":5954,"d":"5954.00"}},"5A"]
["F.01U.363.334","PL - LF-AD-2","Filter medium-superfine-coarse-filtermat",{"v":1993,"d":"1993.00"},{"v":478.51140456182475,"d":"478.51"},{"v":2251,"d":"2251.00"},"5A"]
["F.01U.363.335","PL - RSV-R25","Non return valve, spring loaded",{"v":893,"d":"893.00"},{"v":214.40576230492198,"d":"214.41"},{"v":1009,"d":"1009.00"},"5A"]
["F.01U.363.336","PL - KA-1","Steam trap",{"v":2328,"d":"2328.00"},{"v":558.9435774309724,"d":"558.94"},{"v":2629,"d":"2629.00"},"5A"]
["F.01U.363.337","PL - AK-2,0","Airflow 2,0mm reducer for deep freeze",{"v":93,"d":"93.00"},{"v":22.328931572629052,"d":"22.33"},{"v":105,"d":"105.00"},"5A","Minimalne zamówienie paczka 10 sztuk lub wielokrotność 10. Jeżeli potrzebujesz 30 sztuk zamawiasz 30 "]
["F.01U.363.338","PL - AK-2,5","Airflow 2,5mm reducer for deep freeze",{"v":93,"d":"93.00"},{"v":22.328931572629052,"d":"22.33"},{"v":105,"d":"105.00"},"5A","Minimalna wielkość zamówienia 10 sztuk, cena za sztukę. Zamawiać 10 lub wielokrotność 10."]
["F.01U.363.339","PL - AK-3,0","Airflow 3,0mm reducer for deep freeze",{"v":93,"d":"93.00"},{"v":22.328931572629052,"d":"22.33"},{"v":105,"d":"105.00"},"5A","Minimalna wielkość zamówienia 10 sztuk, cena za sztukę. Zamawiać 10 lub wielokrotność 10."]
["F.01U.363.340","PL - AK-3,2","Airflow 3,2mm reducer for deep freeze",{"v":93,"d":"93.00"},{"v":22.328931572629052,"d":"22.33"},{"v":105,"d":"105.00"},"5A","Minimalna wielkość zamówienia 10 sztuk, cena za sztukę. Zamawiać 10 lub wielokrotność 10."]
["F.01U.363.341","PL - AK-3,4","Airflow 3,4mm reducer for deep freeze",{"v":93,"d":"93.00"},{"v":22.328931572629052,"d":"22.33"},{"v":105,"d":"105.00"},"5A","Minimalna wielkość zamówienia 10 sztuk, cena za sztukę. Zamawiać 10 lub wielokrotność 10."]
{"$rows_left_out":27}
{"sheet":"Dodatkowa gwarancja","index":3,"n_rows":15,"n_cols":7,"rows_kept":15,"hidden":true,"merged":[[1,0,2,6],[3,0,3,6]]}
[]
["Ceny rozszerzeń gwarancji nie podlegają rabatowaniu projektowemu. Przyznawany jest tylko rabat bazowy."]
[]
["Zamawiasz tyle sztuk, ile sztuk danego produktu chcesz objąć dodatkową gwarancją na 12-msc. Dwukrotność tej ilości, aby zapewnić dodatkowe 24-msc (maksymalna długość gwarancji razem wynosi 5 lat)."]
["SAP","TYP","OPIS","stara CENA REUP PLN","CENA REUP PLN","Grupa rabatowa","Informacje do zamówienia"]
["F.01U.360.726","EWE-FPA5MPC-IW","12 msc. rozszrzerzenie gwarancji na kontroler centrali FPA-5000",{"v":85,"d":"85.00"},{"$f":"VLOOKUP(A6,'Warranty Extension'!$B$3:$G$20,5,0)","v":{"v":103,"d":"103.00"}},"5A"]
["F.01U.360.727","EWE-FPA5FMR-IW","12 msc. rozszrzenie gwarancji na panel wyniesiony FMR-5000",{"v":113,"d":"113.00"},{"$f":"VLOOKUP(A7,'Warranty Extension'!$B$3:$G$20,5,0)","v":{"v":137,"d":"137.00"}},"5A"]
["F.01U.360.729","EWE-FPDVC-IW","12 msc. rozszrzenie gwarancji na moduł wej./wyj.",{"v":14,"d":"14.00"},{"$f":"VLOOKUP(A8,'Warranty Extension'!$B$3:$G$20,5,0)","v":{"v":17,"d":"17.00"}},"5A"]
["F.01U.360.730","EWE-LSN1500-IW","12 msc. rozszrzenie gwarancji na moduł LSN1500",{"v":85,"d":"85.00"},{"$f":"VLOOKUP(A9,'Warranty Extension'!$B$3:$G$20,5,0)","v":{"v":103,"d":"103.00"}},"5A"]
["F.01U.360.731","EWE-FPA5MD-IW","12 msc. rozszrzenie gwarancji na moduł centrali FPA",{"v":28,"d":"28.00"},{"$f":"VLOOKUP(A10,'Warranty Extension'!$B$3:$G$20,5,0)","v":{"v":34,"d":"34.00"}},"5A"]
["F.01U.360.733","EWE-FAP520-IW","12 msc. rozszrzenie gwarancji na czujnik FAP520",{"v":28,"d":"28.00"},{"$f":"VLOOKUP(A11,'Warranty Extension'!$B$3:$G$20,5,0)","v":{"v":34,"d":"34.00"}},"5A"]
["F.01U.360.735","EWE-FPC500-IW","12 msc. rozszrzenie gwarancji na centralę FPC-500",{"v":57,"d":"57.00"},{"$f":"VLOOKUP(A12,'Warranty Extension'!$B$3:$G$20,5,0)","v":{"v":69,"d":"69.00"}},"5A"]
["F.01U.360.736","EWE-FPTDT-IW","12 msc. rozszrzenie gwarancji na czujkę FAP-425",{"v":14,"d":"14.00"},{"$f":"VLOOKUP(A13,'Warranty Extension'!$B$3:$G$20,5,0)","v":{"v":17,"d":"17.00"}},"5A"]
["F.01U.360.742","EWE-UPS2416-IW","12 msc. rozszrzenie gwarancji na UPS2426 zasilacz centrali",{"v":57,"d":"57.00"},{"$f":"VLOOKUP(A14,'Warranty Extension'!$B$3:$G$20,5,0)","v":{"v":69,"d":"69.00"}},"5A"]
["F.01U.360.765","EWE-AVIOTEC-IW","12 msc. rozszrzenie gwarancji na Aviotec starlight 8000",{"v":922,"d":"922.00"},{"$f":"VLOOKUP(A15,'Warranty Extension'!$B$3:$G$20,5,0)","v":{"v":1117,"d":"1117.00"}},"5A"]
{"$rows_left_out":1}
{"sheet":"Uwagi Ogólne","index":4,"n_rows":47,"n_cols":6,"rows_kept":47,"merged":[[2,0,2,8],[3,0,3,8],[15,1,20,8],[34,3,34,4],[34,5,34,6],[35,2,37,2],[35,3,35,4],[35,5,35,6],[36,3,37,4],[36,5,36,6],[37,5,37,6],[38,2,40,2],[38,3,38,4],[38,5,38,6],[39,3,40,4],[39,5,39,6],[40,5,40,6],[41,2,42,2],[41,3,41,4],[41,5,41,6],[42,3,42,4],[42,5,42,6],[43,3,43,4],[43,5,43,6],[44,3,44,4],[44,5,44,6],[45,2,46,2],[45,3,45,4],[45,5,45,6],[46,3,46,4],[46,5,46,6]]}
[]
["Wyjaśnienia dotyczące cenników. Opisane tematy:"]
["- Gwarancja"]
["- Klasyfikacja 1- A-B-C"]
[]
[null,"Na czerwono oznaczono produkty nowe. "]
[null,"Na niebiesko oznaczono produkty których cena uległa zmianie. "]
[null,"Na szaro produkty wycofane z cennika "]
[]
[null,"Przy składaniu ofert na produkty zawarte w cenniku należy zweryfikować czy produkt posiada aktualny certyfikat"]
[null,"Certyfikaty do pobrania pod produktami na stronie: www.boschsecurity.pl"]
[]
[]
[]
["Gwarancja"]
{"$rows_left_out":33}
{"sheet":"Fire EN 54_old","index":5,"n_rows":503,"n_cols":19,"rows_kept":503,"hidden":true}
["Change Indicator",null,"BU Fire reference REUP List Q1-2 / 2025  -   V1.3",{"$nulls":3},"Note: Warranty extension available on demand for specific products"]
[null,"12 NC","CTN","SAPnumber","Description","Discount Category","REUP EMEA valid 01.06.2025","REUP PL valid 01.06.2025","Warranty Extension","Status","ABC Code","HS Code","Country of Origin","Spike order","Net weight \n(kg)","Order Info","Repair process","Remarks","EAN code single"]
[null,"Modular Panel"]
[null,"Modules FPA-5000 and AVENAR Panels"]
[null,"7050 000 81384","BCM-0000-B","F.01U.081.384","BCM 0000 B  Battery Controller Module","5A",211.69,{"$f":"ROUND(ROUND(G5*4.8,2),0)","v":{"v":1016,"d":"1,016.00"}},"on demand","C",1,8537109199,"CN",148,"0.342",null,"SBN",null,800549180153]
[null,"6649 981 37262","ANI 0016 A","4.998.137.262","ANI 0016 A  16 Point Annunciator internal","5A",127.02,{"$f":"ROUND(ROUND(G6*4.8,2),0)","v":{"v":610,"d":"610.00"}},"on demand","C","A",8537109199,"CN",7,"0.26",null,"SBN",null,8717332205882]
[null,"6649 981 37265","RML 0008 A","4.998.137.265","RML 0008 A  Relay Low Voltage","5A",169.34,{"v":813,"d":"813.00"},"on demand","C",1,8537109199,"CN",98,"0.306",null,"SBN",null,8717332205912]
[null,"6649 981 37266","IOS 0020 A","4.998.137.266","IOS 0020 A  20mA Communication Module","5A",254.03,{"v":1219,"d":"1,219.00"},"on demand","C",1,8537109199,"CN",15,"0.594",null,"SBN",null,8717332205929]
[null,"6649 981 37267","IOS 0232 A","4.998.137.267","IOS 0232 A  RS232 Communication Module","5A",254.03,{"v":1219,"d":"1,219.00"},"on demand","C","A",8537109199,"CN",4,"0.233",null,"SBN",null,8717332205936]
[null,"6649 981 37269","IOP 0008 A","4.998.137.269","IOP 0008 A  8 input/output OC module","5A",232.51,{"v":1116,"d":"1,116.00"},"on demand","C",1,8537109199,"CN",17,"0.299",null,"SBN",null,8717332205943]
[null,"6649 981 37270","CZM 0004 A","4.998.137.270","CZM 0004 A  4 Zone Conventional Zone Module","5A",459.06,{"v":2203,"d":"2,203.00"},"on demand","C",1,8537109199,"CN",52,"0.333",null,"SBN",null,8717332205950]
[null,"7050 000 63204","ENO 0000 B","F.01U.063.204","ENO 0000 B (External Notification)","5A",{"v":338.7,"d":"338.70"},{"v":1626,"d":"1,626.00"},"on demand","C",1,8537109199,"CN",79,"0.27",null,"SBN",null,800549134231]
[null,"6649 981 37274","RMH 0002 A","4.998.137.274","RMH 0002 A  2 Zone Relay high voltage","5A",387.52,{"v":1860,"d":"1,860.00"},"on demand","C","A",8537109199,"CN",15,"0.31",null,"SBN",null,8717332205998]
[null,"6649 981 37275","NZM 0002 A","4.998.137.275","NZM 0002 A  2 Zone NAC Zone Module","5A",{"v":338.7,"d":"338.70"},{"v":1626,"d":"1,626.00"},"on demand","C",1,8537109199,"CN",37,"0.306",null,"SBN",null,8717332206001]
[null,"6650 000 28289","FPE-5000-UGM","F.01U.028.289","UGM interface module","5A",447.07,{"v":2146,"d":"2,146.00"},"no W-Extension","C","A",8537109199,"CN",32,"0.27",null,"SBN",null,8717332260041]
{"$rows_left_out":489}
{"sheet":"Fire EN 54 FX 4,704","index":6,"n_rows":500,"n_cols":19,"rows_kept":500,"hidden":true}
["Change Indicator",null,"BU Fire reference REUP List Q3-4 / 2025   -   V1.3"]
[null,"12 NC","CTN","SAPnumber","Description","Discount Category","REUP EMEA valid 01.07.2025","FX=4,704 REUP PL valid 01.07.2025","Warranty Extension","Status","ABC Code","HS Code","Country of Origin","Spike order","Net weight \n(kg)","Order Info","Repair process","Remarks","EAN code single"]
[null,"Modular Panel"]
[null,"Modules FPA-5000 and AVENAR Panels"]
[null,"7050 000 81384","BCM-0000-B","F.01U.081.384","BCM 0000 B  Battery Controller Module","5A",215.92,{"$f":"ROUND(ROUND(G5*4.704,2),0)","v":{"v":1016,"d":"1,016.00"}},"on demand","C",1,8537109199,"CN",148,"0.342",null,"SBN",null,800549180153]
[null,"6649 981 37262","ANI 0016 A","4.998.137.262","ANI 0016 A  16 Point Annunciator internal","5A",129.56,{"$f":"ROUND(ROUND(G6*4.704,2),0)","v":{"v":609,"d":"609.00"}},"on demand","C","A",8537109199,"CN",7,"0.26",null,"SBN",null,8717332205882]
[null,"6649 981 37265","RML 0008 A","4.998.137.265","RML 0008 A  Relay Low Voltage","5A",172.73,{"v":813,"d":"813.00"},"on demand","C",1,8537109199,"CN",98,"0.306",null,"SBN",null,8717332205912]
["x","6649 981 37266","IOS 0020 A","4.998.137.266","IOS 0020 A  20mA Communication Module","5A",{"v":470,"d":"470.00"},{"v":2211,"d":"2,211.00"},"on demand","C",1,8537109199,"CN",15,"0.594",null,"SBN",null,8717332205929]
[null,"6649 981 37267","IOS 0232 A","4.998.137.267","IOS 0232 A  RS232 Communication Module","5A",259.11,{"v":1219,"d":"1,219.00"},"on demand","C","A",8537109199,"CN",4,"0.233",null,"SBN",null,8717332205936]
[null,"6649 981 37269","IOP 0008 A","4.998.137.269","IOP 0008 A  8 input/output OC module","5A",237.16,{"v":1116,"d":"1,116.00"},"on demand","C",1,8537109199,"CN",17,"0.299",null,"SBN",null,8717332205943]
[null,"6649 981 37270","CZM 0004 A","4.998.137.270","CZM 0004 A  4 Zone Conventional Zone Module","5A",468.24,{"v":2203,"d":"2,203.00"},"on demand","C",1,8537109199,"CN",52,"0.333",null,"SBN",null,8717332205950]
[null,"7050 000 63204","ENO 0000 B","F.01U.063.204","ENO 0000 B (External Notification)","5A",345.47,{"v":1625,"d":"1,625.00"},"on demand","C",1,8537109199,"CN",79,"0.27",null,"SBN",null,800549134231]
[null,"6649 981 37274","RMH 0002 A","4.998.137.274","RMH 0002 A  2 Zone Relay high voltage","5A",395.27,{"v":1859,"d":"1,859.00"},"on demand","C","A",8537109199,"CN",15,"0.31",null,"SBN",null,8717332205998]
[null,"6649 981 37275","NZM 0002 A","4.998.137.275","NZM 0002 A  2 Zone NAC Zone Module","5A",345.47,{"v":1625,"d":"1,625.00"},"on demand","C",1,8537109199,"CN",37,"0.306",null,"SBN",null,8717332206001]
[null,"6650 000 28289","FPE-5000-UGM","F.01U.028.289","UGM interface module","5A",456.01,{"v":2145,"d":"2,145.00"},"no W-Extension","C","A",8537109199,"CN",32,"0.27",null,"SBN",null,8717332260041]
{"$rows_left_out":486}
{"sheet":"Fire EN 54","index":7,"n_rows":508,"n_cols":19,"rows_kept":508,"hidden":true}
["Change Indicator",null,"BU Fire reference REUP List Q1-2 / 2026   -   V1.0"]
[null,"12 NC","CTN","SAPnumber","Description","Discount Category","2026-01-01","FX=4,704 REUP PL valid 01.01.2026","Warranty Period (years)","Status","ABC Code","HS Code","Country of Origin","Spike order","Net weight \n(kg)","Order Info","Repair process","Remarks","EAN code single"]
[null,"Modular Panel"]
[null,"AVENAR panel modules "]
[null,"7050 000 81384","BCM-0000-B","F.01U.081.384","BCM 0000 B  Battery Controller Module","5A",220.24,{"$f":"ROUND(ROUND(G5*4.704,2),0)","v":{"v":1036,"d":"1,036.00"}},5,"C",1,8537109199,"CN",148,"0.342",null,"SBN",null,800549180153]
[null,"6649 981 37262","ANI 0016 A","4.998.137.262","ANI 0016 A  16 Point Annunciator internal","5A",132.15,{"$f":"ROUND(ROUND(G6*4.704,2),0)","v":{"v":622,"d":"622.00"}},5,"C","A",8537109199,"CN",7,"0.26",null,"SBN",null,8717332205882]
[null,"6649 981 37265","RML 0008 A","4.998.137.265","RML 0008 A  Relay Low Voltage","5A",176.18,{"v":829,"d":"829.00"},5,"C",1,8537109199,"CN",98,"0.306",null,"SBN",null,8717332205912]
[null,"6649 981 37266","IOS 0020 A","4.998.137.266","IOS 0020 A  20mA Communication Module","5A",{"v":479.4,"d":"479.40"},{"v":2255,"d":"2,255.00"},5,"C",1,8537109199,"CN",15,"0.594",null,"SBN",null,8717332205929]
[null,"6649 981 37267","IOS 0232 A","4.998.137.267","IOS 0232 A  RS232 Communication Module","5A",264.29,{"v":1243,"d":"1,243.00"},5,"C","A",8537109199,"CN",4,"0.233",null,"SBN",null,8717332205936]
[null,"6649 981 37269","IOP 0008 A","4.998.137.269","IOP 0008 A  8 input/output OC module","5A",{"v":241.9,"d":"241.90"},{"v":1138,"d":"1,138.00"},5,"C",1,8537109199,"CN",17,"0.299",null,"SBN",null,8717332205943]
[null,"6649 981 37270","CZM 0004 A","4.998.137.270","CZM 0004 A  4 Zone Conventional Zone Module","5A",{"v":477.6,"d":"477.60"},{"v":2247,"d":"2,247.00"},5,"C",1,8537109199,"CN",52,"0.333",null,"SBN",null,8717332205950]
[null,"7050 000 63204","ENO 0000 B","F.01U.063.204","ENO 0000 B (External Notification)","5A",352.38,{"v":1658,"d":"1,658.00"},5,"C",1,8537109199,"CN",79,"0.27",null,"SBN",null,800549134231]
[null,"6649 981 37274","RMH 0002 A","4.998.137.274","RMH 0002 A  2 Zone Relay high voltage","5A",403.18,{"v":1897,"d":"1,897.00"},5,"C","A",8537109199,"CN",15,"0.31",null,"SBN",null,8717332205998]
[null,"6649 981 37275","NZM 0002 A","4.998.137.275","NZM 0002 A  2 Zone NAC Zone Module","5A",352.38,{"v":1658,"d":"1,658.00"},5,"C",1,8537109199,"CN",37,"0.306",null,"SBN",null,8717332206001]
[null,"6650 000 28289","FPE-5000-UGM","F.01U.028.289","UGM interface module","5A",465.13,{"v":2188,"d":"2,188.00"},5,"C","A",8537109199,"CN",32,"0.27",null,"SBN",null,8717332260041]
{"$rows_left_out":494}
{"sheet":"Warranty Extension","index":8,"n_rows":20,"n_cols":23,"rows_kept":20,"hidden":true}
["Note: For Warranty extension only base discount can be applied"]
["Commercial Type Number (CTN)","Material Number (Mat/N)","Short Description","Currency","Price [per packaging unit]","Price PLN","Price valid from [date]","Discount category","Delivery status","Last change of delivery status [date]","Last date of availability","Orders placed up to [units]","Order shipping occurrence within working [days]","Stocking location","Minimum Order Quantity [in pieces]","Multipack Quantity [in pieces]","Packaging Unit [in pieces]","Successor or Substitute Product","Country of origin","European Article Number (EAN)","Universal Product Code (UPC)","Commodity code","Dual use"]
["EWE-FPA5MPC-IW","F.01U.360.726","12mths wrty ext FPA-5000 Main Panel Con.","EUR",21.46,{"$f":"ROUND(ROUND(E3*4.8,2),0)","v":{"v":103,"d":"103.00"}},"2023-01-01","5A","S3 - available",null,null,"n.a.","Contact Customer Service","Software/Service",1,1,1,{"$nulls":5},"No"]
["EWE-FPA5FMR-IW","F.01U.360.727","12mths wrty ext FPA-5000 Remote Keypad","EUR",28.64,{"$f":"ROUND(ROUND(E4*4.8,2),0)","v":{"v":137,"d":"137.00"}},"2023-01-02","5A","S3 - available",null,null,"n.a.","Contact Customer Service","Software/Service",1,1,1,{"$nulls":5},"No"]
["EWE-FPA1200-IW","F.01U.360.728","12mths wrty ext FPA-1200","EUR",{"v":53.7,"d":"53.70"},{"v":258,"d":"258.00"},"2023-01-03","5A","S3 - available",null,null,"n.a.","Contact Customer Service","Software/Service",1,1,1,{"$nulls":5},"No"]
["EWE-FPDVC-IW","F.01U.360.729","12mths wrty ext Fire Peripheral Device","EUR",3.58,{"v":17,"d":"17.00"},"2023-01-04","5A","S3 - available",null,null,"n.a.","Contact Customer Service","Software/Service",1,1,1,{"$nulls":5},"No"]
["EWE-LSN1500-IW","F.01U.360.730","12mths wrty ext  FPA-5000 LSN 1500 Mod.","EUR",21.46,{"v":103,"d":"103.00"},"2023-01-05","5A","S3 - available",null,null,"n.a.","Contact Customer Service","Software/Service",1,1,1,{"$nulls":5},"No"]
["EWE-FPA5MD-IW","F.01U.360.731","12mths wrty ext  FPA-5000 Panel Module","EUR",7.15,{"v":34,"d":"34.00"},"2023-01-06","5A","S3 - available",null,null,"n.a.","Contact Customer Service","Software/Service",1,1,1,{"$nulls":5},"No"]
["EWE-DS10-IW","F.01U.360.732","12mths wrty ext DS10 DIN tone sounder","EUR",14.32,{"v":69,"d":"69.00"},"2023-01-07","5A","S3 - available",null,null,"n.a.","Contact Customer Service","Software/Service",1,1,1,{"$nulls":5},"No"]
["EWE-FAP520-IW","F.01U.360.733","12mths wrty ext FAP520 detector","EUR",7.15,{"v":34,"d":"34.00"},"2023-01-08","5A","S3 - available",null,null,"n.a.","Contact Customer Service","Software/Service",1,1,1,{"$nulls":5},"No"]
["EWE-FCP500-IW","F.01U.360.734","12mths wrty ext FAP500 detector","EUR",10.74,{"v":52,"d":"52.00"},"2023-01-09","5A","S3 - available",null,null,"n.a.","Contact Customer Service","Software/Service",1,1,1,{"$nulls":5},"No"]
["EWE-FPC500-IW","F.01U.360.735","12mths wrty ext  Conventional Fire panel","EUR",14.32,{"v":69,"d":"69.00"},"2023-01-10","5A","S3 - available",null,null,"n.a.","Contact Customer Service","Software/Service",1,1,1,{"$nulls":5},"No"]
["EWE-FPTDT-IW","F.01U.360.736","12mths wrty ext Fire Point Detector","EUR",3.58,{"v":17,"d":"17.00"},"2023-01-11","5A","S3 - available",null,null,"n.a.","Contact Customer Service","Software/Service",1,1,1,{"$nulls":5},"No"]
["EWE-UPS2416-IW","F.01U.360.742","12mths wrty ext UPS2426 Power Supply","EUR",14.32,{"v":69,"d":"69.00"},"2023-01-12","5A","S3 - available",null,null,"n.a.","Contact Customer Service","Software/Service",1,1,1,{"$nulls":5},"No"]
["EWE-FCS320-IW","F.01U.360.756","12mths wrty ext  FCS-320","EUR",57.26,{"v":275,"d":"275.00"},"2023-01-13","5A","S3 - available",null,null,"n.a.","Contact Customer Service","Software/Service",1,1,1,{"$nulls":5},"No"]
{"$rows_left_out":5}